{"text_format":"1","workbook":"xlsx","n_sheets":9,"sheets":["Home","General Tickets","Driver_01","Driver_02","Driver_03","Driver_04","Shop_01","Summary","Checking"],"not_rendered":{"charts":0,"images":0,"macros":1,"external_links":0,"defined_names":2,"comments":0,"pivot_tables":0},"unopened":[],"bounds":{"document_bytes":16777216,"sheet_cells":100000,"rows_first":2000,"rows_last":500,"rows_between":2000,"halvings":0,"cell_chars":16384,"cell_head_chars":4096},"cells_cut":0,"cells_raw":0,"read":"whole","date_system":"1900"}

{"sheet":"Home","index":0,"n_rows":0,"n_cols":0,"rows_kept":0,"cut":false,"hidden":false,"merged":[]}

{"sheet":"General Tickets","index":1,"n_rows":104,"n_cols":15,"rows_kept":104,"cut":false,"hidden":false,"merged":[[0,0,0,1],[0,8,0,9]]}
["PC _ 01",null,"Driver_01","Driver_02","Driver_03","Driver_04","Shop_01",null,"PC _ 02",null,"Driver_01","Driver_02","Driver_03","Driver_04","Shop_01"]
[1,{"$f":"IF(SUM(C2:G2)<0.5,\"Missing\",SUM(C2:G2))","v":"Missing"},{"$f":"IFERROR(VLOOKUP(A2,Driver_01!$A$2:$B$150,2,FALSE),\"\")","v":""},{"$f":"IFERROR(VLOOKUP(A2,Driver_02!$A$2:$B$150,2,FALSE),\"\")","v":""},{"$f":"IFERROR(VLOOKUP(A2,Driver_03!$A$2:$B$150,2,FALSE),\"\")","v":""},{"$f":"IFERROR(VLOOKUP(A2,Driver_04!$A$2:$B$150,2,FALSE),\"\")","v":""},{"$f":"IFERROR(VLOOKUP(A2,Shop_01!$A$2:$B$188,2,FALSE),\"\")","v":""},null,201,{"$f":"IF(SUM(K2:O2)<0.5,\"Missing\",SUM(K2:O2))","v":"Missing"},{"$f":"IFERROR(VLOOKUP(I2,Driver_01!$A$2:$B$150,2,FALSE),\"\")","v":""},{"$f":"IFERROR(VLOOKUP(I2,Driver_02!$A$2:$B$150,2,FALSE),\"\")","v":""},{"$f":"IFERROR(VLOOKUP(I2,Driver_03!$A$2:$B$150,2,FALSE),\"\")","v":""},{"$f":"IFERROR(VLOOKUP(I2,Driver_04!$A$2:$B$150,2,FALSE),\"\")","v":""},{"$f":"IFERROR(VLOOKUP(I2,Shop_01!$A$2:$B$150,2,FALSE),\"\")","v":""}]
[{"$f":"A2+1","v":2},"Missing",{"$f":"IFERROR(VLOOKUP(A3,Driver_01!$A$2:$B$150,2,FALSE),\"\")","v":""},{"$f":"IFERROR(VLOOKUP(A3,Driver_02!$A$2:$B$150,2,FALSE),\"\")","v":""},{"$f":"IFERROR(VLOOKUP(A3,Driver_03!$A$2:$B$150,2,FALSE),\"\")","v":""},{"$f":"IFERROR(VLOOKUP(A3,Driver_04!$A$2:$B$150,2,FALSE),\"\")","v":""},{"$f":"IFERROR(VLOOKUP(A3,Shop_01!$A$2:$B$188,2,FALSE),\"\")","v":""},null,{"$f":"I2+1","v":202},"Missing",{"$f":"IFERROR(VLOOKUP(I3,Driver_01!$A$2:$B$150,2,FALSE),\"\")","v":""},{"$f":"IFERROR(VLOOKUP(I3,Driver_02!$A$2:$B$150,2,FALSE),\"\")","v":""},{"$f":"IFERROR(VLOOKUP(I3,Driver_03!$A$2:$B$150,2,FALSE),\"\")","v":""},{"$f":"IFERROR(VLOOKUP(I3,Driver_04!$A$2:$B$150,2,FALSE),\"\")","v":""},{"$f":"IFERROR(VLOOKUP(I3,Shop_01!$A$2:$B$150,2,FALSE),\"\")","v":""}]
[{"$f":"A3+1","v":3},"Missing",{"$f":"IFERROR(VLOOKUP(A4,Driver_01!$A$2:$B$150,2,FALSE),\"\")","v":""},{"$f":"IFERROR(VLOOKUP(A4,Driver_02!$A$2:$B$150,2,FALSE),\"\")","v":""},{"$f":"IFERROR(VLOOKUP(A4,Driver_03!$A$2:$B$150,2,FALSE),\"\")","v":""},{"$f":"IFERROR(VLOOKUP(A4,Driver_04!$A$2:$B$150,2,FALSE),\"\")","v":""},{"$f":"IFERROR(VLOOKUP(A4,Shop_01!$A$2:$B$188,2,FALSE),\"\")","v":""},null,{"$f":"I3+1","v":203},"Missing",{"$f":"IFERROR(VLOOKUP(I4,Driver_01!$A$2:$B$150,2,FALSE),\"\")","v":""},{"$f":"IFERROR(VLOOKUP(I4,Driver_02!$A$2:$B$150,2,FALSE),\"\")","v":""},{"$f":"IFERROR(VLOOKUP(I4,Driver_03!$A$2:$B$150,2,FALSE),\"\")","v":""},{"$f":"IFERROR(VLOOKUP(I4,Driver_04!$A$2:$B$150,2,FALSE),\"\")","v":""},{"$f":"IFERROR(VLOOKUP(I4,Shop_01!$A$2:$B$150,2,FALSE),\"\")","v":""}]
[4,{"$f":"IF(SUM(C5:G5)<0.5,\"Missing\",SUM(C5:G5))","v":"Missing"},{"$f":"IFERROR(VLOOKUP(A5,Driver_01!$A$2:$B$150,2,FALSE),\"\")","v":""},{"$f":"IFERROR(VLOOKUP(A5,Driver_02!$A$2:$B$150,2,FALSE),\"\")","v":""},{"$f":"IFERROR(VLOOKUP(A5,Driver_03!$A$2:$B$150,2,FALSE),\"\")","v":""},{"$f":"IFERROR(VLOOKUP(A5,Driver_04!$A$2:$B$150,2,FALSE),\"\")","v":""},{"$f":"IFERROR(VLOOKUP(A5,Shop_01!$A$2:$B$188,2,FALSE),\"\")","v":""},null,204,"Missing",{"$f":"IFERROR(VLOOKUP(I5,Driver_01!$A$2:$B$150,2,FALSE),\"\")","v":""},{"$f":"IFERROR(VLOOKUP(I5,Driver_02!$A$2:$B$150,2,FALSE),\"\")","v":""},{"$f":"IFERROR(VLOOKUP(I5,Driver_03!$A$2:$B$150,2,FALSE),\"\")","v":""},{"$f":"IFERROR(VLOOKUP(I5,Driver_04!$A$2:$B$150,2,FALSE),\"\")","v":""},{"$f":"IFERROR(VLOOKUP(I5,Shop_01!$A$2:$B$150,2,FALSE),\"\")","v":""}]
[5,{"$f":"IF(SUM(C6:G6)<0.5,\"Missing\",SUM(C6:G6))","v":"Missing"},{"$f":"IFERROR(VLOOKUP(A6,Driver_01!$A$2:$B$150,2,FALSE),\"\")","v":""},{"$f":"IFERROR(VLOOKUP(A6,Driver_02!$A$2:$B$150,2,FALSE),\"\")","v":""},{"$f":"IFERROR(VLOOKUP(A6,Driver_03!$A$2:$B$150,2,FALSE),\"\")","v":""},{"$f":"IFERROR(VLOOKUP(A6,Driver_04!$A$2:$B$150,2,FALSE),\"\")","v":""},{"$f":"IFERROR(VLOOKUP(A6,Shop_01!$A$2:$B$188,2,FALSE),\"\")","v":""},null,205,"Missing",{"$f":"IFERROR(VLOOKUP(I6,Driver_01!$A$2:$B$150,2,FALSE),\"\")","v":""},{"$f":"IFERROR(VLOOKUP(I6,Driver_02!$A$2:$B$150,2,FALSE),\"\")","v":""},{"$f":"IFERROR(VLOOKUP(I6,Driver_03!$A$2:$B$150,2,FALSE),\"\")","v":""},{"$f":"IFERROR(VLOOKUP(I6,Driver_04!$A$2:$B$150,2,FALSE),\"\")","v":""},{"$f":"IFERROR(VLOOKUP(I6,Shop_01!$A$2:$B$150,2,FALSE),\"\")","v":""}]
[6,"Missing",{"$f":"IFERROR(VLOOKUP(A7,Driver_01!$A$2:$B$150,2,FALSE),\"\")","v":""},{"$f":"IFERROR(VLOOKUP(A7,Driver_02!$A$2:$B$150,2,FALSE),\"\")","v":""},{"$f":"IFERROR(VLOOKUP(A7,Driver_03!$A$2:$B$150,2,FALSE),\"\")","v":""},{"$f":"IFERROR(VLOOKUP(A7,Driver_04!$A$2:$B$150,2,FALSE),\"\")","v":""},{"$f":"IFERROR(VLOOKUP(A7,Shop_01!$A$2:$B$188,2,FALSE),\"\")","v":""},null,206,"Missing",{"$f":"IFERROR(VLOOKUP(I7,Driver_01!$A$2:$B$150,2,FALSE),\"\")","v":""},{"$f":"IFERROR(VLOOKUP(I7,Driver_02!$A$2:$B$150,2,FALSE),\"\")","v":""},{"$f":"IFERROR(VLOOKUP(I7,Driver_03!$A$2:$B$150,2,FALSE),\"\")","v":""},{"$f":"IFERROR(VLOOKUP(I7,Driver_04!$A$2:$B$150,2,FALSE),\"\")","v":""},{"$f":"IFERROR(VLOOKUP(I7,Shop_01!$A$2:$B$150,2,FALSE),\"\")","v":""}]
[7,"Missing",{"$f":"IFERROR(VLOOKUP(A8,Driver_01!$A$2:$B$150,2,FALSE),\"\")","v":""},{"$f":"IFERROR(VLOOKUP(A8,Driver_02!$A$2:$B$150,2,FALSE),\"\")","v":""},{"$f":"IFERROR(VLOOKUP(A8,Driver_03!$A$2:$B$150,2,FALSE),\"\")","v":""},{"$f":"IFERROR(VLOOKUP(A8,Driver_04!$A$2:$B$150,2,FALSE),\"\")","v":""},{"$f":"IFERROR(VLOOKUP(A8,Shop_01!$A$2:$B$188,2,FALSE),\"\")","v":""},null,207,"Missing",{"$f":"IFERROR(VLOOKUP(I8,Driver_01!$A$2:$B$150,2,FALSE),\"\")","v":""},{"$f":"IFERROR(VLOOKUP(I8,Driver_02!$A$2:$B$150,2,FALSE),\"\")","v":""},{"$f":"IFERROR(VLOOKUP(I8,Driver_03!$A$2:$B$150,2,FALSE),\"\")","v":""},{"$f":"IFERROR(VLOOKUP(I8,Driver_04!$A$2:$B$150,2,FALSE),\"\")","v":""},{"$f":"IFERROR(VLOOKUP(I8,Shop_01!$A$2:$B$150,2,FALSE),\"\")","v":""}]
[8,"Missing",{"$f":"IFERROR(VLOOKUP(A9,Driver_01!$A$2:$B$150,2,FALSE),\"\")","v":""},{"$f":"IFERROR(VLOOKUP(A9,Driver_02!$A$2:$B$150,2,FALSE),\"\")","v":""},{"$f":"IFERROR(VLOOKUP(A9,Driver_03!$A$2:$B$150,2,FALSE),\"\")","v":""},{"$f":"IFERROR(VLOOKUP(A9,Driver_04!$A$2:$B$150,2,FALSE),\"\")","v":""},{"$f":"IFERROR(VLOOKUP(A9,Shop_01!$A$2:$B$188,2,FALSE),\"\")","v":""},null,208,"Missing",{"$f":"IFERROR(VLOOKUP(I9,Driver_01!$A$2:$B$150,2,FALSE),\"\")","v":""},{"$f":"IFERROR(VLOOKUP(I9,Driver_02!$A$2:$B$150,2,FALSE),\"\")","v":""},{"$f":"IFERROR(VLOOKUP(I9,Driver_03!$A$2:$B$150,2,FALSE),\"\")","v":""},{"$f":"IFERROR(VLOOKUP(I9,Driver_04!$A$2:$B$150,2,FALSE),\"\")","v":""},{"$f":"IFERROR(VLOOKUP(I9,Shop_01!$A$2:$B$150,2,FALSE),\"\")","v":""}]
[9,"Missing",{"$f":"IFERROR(VLOOKUP(A10,Driver_01!$A$2:$B$150,2,FALSE),\"\")","v":""},{"$f":"IFERROR(VLOOKUP(A10,Driver_02!$A$2:$B$150,2,FALSE),\"\")","v":""},{"$f":"IFERROR(VLOOKUP(A10,Driver_03!$A$2:$B$150,2,FALSE),\"\")","v":""},{"$f":"IFERROR(VLOOKUP(A10,Driver_04!$A$2:$B$150,2,FALSE),\"\")","v":""},{"$f":"IFERROR(VLOOKUP(A10,Shop_01!$A$2:$B$188,2,FALSE),\"\")","v":""},null,209,"Missing",{"$f":"IFERROR(VLOOKUP(I10,Driver_01!$A$2:$B$150,2,FALSE),\"\")","v":""},{"$f":"IFERROR(VLOOKUP(I10,Driver_02!$A$2:$B$150,2,FALSE),\"\")","v":""},{"$f":"IFERROR(VLOOKUP(I10,Driver_03!$A$2:$B$150,2,FALSE),\"\")","v":""},{"$f":"IFERROR(VLOOKUP(I10,Driver_04!$A$2:$B$150,2,FALSE),\"\")","v":""},{"$f":"IFERROR(VLOOKUP(I10,Shop_01!$A$2:$B$150,2,FALSE),\"\")","v":""}]
[10,"Missing",{"$f":"IFERROR(VLOOKUP(A11,Driver_01!$A$2:$B$150,2,FALSE),\"\")","v":""},{"$f":"IFERROR(VLOOKUP(A11,Driver_02!$A$2:$B$150,2,FALSE),\"\")","v":""},{"$f":"IFERROR(VLOOKUP(A11,Driver_03!$A$2:$B$150,2,FALSE),\"\")","v":""},{"$f":"IFERROR(VLOOKUP(A11,Driver_04!$A$2:$B$150,2,FALSE),\"\")","v":""},{"$f":"IFERROR(VLOOKUP(A11,Shop_01!$A$2:$B$188,2,FALSE),\"\")","v":""},null,210,"Missing",{"$f":"IFERROR(VLOOKUP(I11,Driver_01!$A$2:$B$150,2,FALSE),\"\")","v":""},{"$f":"IFERROR(VLOOKUP(I11,Driver_02!$A$2:$B$150,2,FALSE),\"\")","v":""},{"$f":"IFERROR(VLOOKUP(I11,Driver_03!$A$2:$B$150,2,FALSE),\"\")","v":""},{"$f":"IFERROR(VLOOKUP(I11,Driver_04!$A$2:$B$150,2,FALSE),\"\")","v":""},{"$f":"IFERROR(VLOOKUP(I11,Shop_01!$A$2:$B$150,2,FALSE),\"\")","v":""}]
[11,"Missing",{"$f":"IFERROR(VLOOKUP(A12,Driver_01!$A$2:$B$150,2,FALSE),\"\")","v":""},{"$f":"IFERROR(VLOOKUP(A12,Driver_02!$A$2:$B$150,2,FALSE),\"\")","v":""},{"$f":"IFERROR(VLOOKUP(A12,Driver_03!$A$2:$B$150,2,FALSE),\"\")","v":""},{"$f":"IFERROR(VLOOKUP(A12,Driver_04!$A$2:$B$150,2,FALSE),\"\")","v":""},{"$f":"IFERROR(VLOOKUP(A12,Shop_01!$A$2:$B$188,2,FALSE),\"\")","v":""},null,211,"Missing",{"$f":"IFERROR(VLOOKUP(I12,Driver_01!$A$2:$B$150,2,FALSE),\"\")","v":""},{"$f":"IFERROR(VLOOKUP(I12,Driver_02!$A$2:$B$150,2,FALSE),\"\")","v":""},{"$f":"IFERROR(VLOOKUP(I12,Driver_03!$A$2:$B$150,2,FALSE),\"\")","v":""},{"$f":"IFERROR(VLOOKUP(I12,Driver_04!$A$2:$B$150,2,FALSE),\"\")","v":""},{"$f":"IFERROR(VLOOKUP(I12,Shop_01!$A$2:$B$150,2,FALSE),\"\")","v":""}]
[12,"Missing",{"$f":"IFERROR(VLOOKUP(A13,Driver_01!$A$2:$B$150,2,FALSE),\"\")","v":""},{"$f":"IFERROR(VLOOKUP(A13,Driver_02!$A$2:$B$150,2,FALSE),\"\")","v":""},{"$f":"IFERROR(VLOOKUP(A13,Driver_03!$A$2:$B$150,2,FALSE),\"\")","v":""},{"$f":"IFERROR(VLOOKUP(A13,Driver_04!$A$2:$B$150,2,FALSE),\"\")","v":""},{"$f":"IFERROR(VLOOKUP(A13,Shop_01!$A$2:$B$188,2,FALSE),\"\")","v":""},null,212,"Missing",{"$f":"IFERROR(VLOOKUP(I13,Driver_01!$A$2:$B$150,2,FALSE),\"\")","v":""},{"$f":"IFERROR(VLOOKUP(I13,Driver_02!$A$2:$B$150,2,FALSE),\"\")","v":""},{"$f":"IFERROR(VLOOKUP(I13,Driver_03!$A$2:$B$150,2,FALSE),\"\")","v":""},{"$f":"IFERROR(VLOOKUP(I13,Driver_04!$A$2:$B$150,2,FALSE),\"\")","v":""},{"$f":"IFERROR(VLOOKUP(I13,Shop_01!$A$2:$B$150,2,FALSE),\"\")","v":""}]
[13,"Missing",{"$f":"IFERROR(VLOOKUP(A14,Driver_01!$A$2:$B$150,2,FALSE),\"\")","v":""},{"$f":"IFERROR(VLOOKUP(A14,Driver_02!$A$2:$B$150,2,FALSE),\"\")","v":""},{"$f":"IFERROR(VLOOKUP(A14,Driver_03!$A$2:$B$150,2,FALSE),\"\")","v":""},{"$f":"IFERROR(VLOOKUP(A14,Driver_04!$A$2:$B$150,2,FALSE),\"\")","v":""},{"$f":"IFERROR(VLOOKUP(A14,Shop_01!$A$2:$B$188,2,FALSE),\"\")","v":""},null,213,"Missing",{"$f":"IFERROR(VLOOKUP(I14,Driver_01!$A$2:$B$150,2,FALSE),\"\")","v":""},{"$f":"IFERROR(VLOOKUP(I14,Driver_02!$A$2:$B$150,2,FALSE),\"\")","v":""},{"$f":"IFERROR(VLOOKUP(I14,Driver_03!$A$2:$B$150,2,FALSE),\"\")","v":""},{"$f":"IFERROR(VLOOKUP(I14,Driver_04!$A$2:$B$150,2,FALSE),\"\")","v":""},{"$f":"IFERROR(VLOOKUP(I14,Shop_01!$A$2:$B$150,2,FALSE),\"\")","v":""}]
[14,"Missing",{"$f":"IFERROR(VLOOKUP(A15,Driver_01!$A$2:$B$150,2,FALSE),\"\")","v":""},{"$f":"IFERROR(VLOOKUP(A15,Driver_02!$A$2:$B$150,2,FALSE),\"\")","v":""},{"$f":"IFERROR(VLOOKUP(A15,Driver_03!$A$2:$B$150,2,FALSE),\"\")","v":""},{"$f":"IFERROR(VLOOKUP(A15,Driver_04!$A$2:$B$150,2,FALSE),\"\")","v":""},{"$f":"IFERROR(VLOOKUP(A15,Shop_01!$A$2:$B$188,2,FALSE),\"\")","v":""},null,214,"Missing",{"$f":"IFERROR(VLOOKUP(I15,Driver_01!$A$2:$B$150,2,FALSE),\"\")","v":""},{"$f":"IFERROR(VLOOKUP(I15,Driver_02!$A$2:$B$150,2,FALSE),\"\")","v":""},{"$f":"IFERROR(VLOOKUP(I15,Driver_03!$A$2:$B$150,2,FALSE),\"\")","v":""},{"$f":"IFERROR(VLOOKUP(I15,Driver_04!$A$2:$B$150,2,FALSE),\"\")","v":""},{"$f":"IFERROR(VLOOKUP(I15,Shop_01!$A$2:$B$150,2,FALSE),\"\")","v":""}]
[15,"Missing",null,{"$f":"IFERROR(VLOOKUP(A16,Driver_02!$A$2:$B$150,2,FALSE),\"\")","v":""},{"$f":"IFERROR(VLOOKUP(A16,Driver_03!$A$2:$B$150,2,FALSE),\"\")","v":""},{"$f":"IFERROR(VLOOKUP(A16,Driver_04!$A$2:$B$150,2,FALSE),\"\")","v":""},{"$f":"IFERROR(VLOOKUP(A16,Shop_01!$A$2:$B$188,2,FALSE),\"\")","v":""},null,215,"Missing",{"$f":"IFERROR(VLOOKUP(I16,Driver_01!$A$2:$B$150,2,FALSE),\"\")","v":""},{"$f":"IFERROR(VLOOKUP(I16,Driver_02!$A$2:$B$150,2,FALSE),\"\")","v":""},{"$f":"IFERROR(VLOOKUP(I16,Driver_03!$A$2:$B$150,2,FALSE),\"\")","v":""},{"$f":"IFERROR(VLOOKUP(I16,Driver_04!$A$2:$B$150,2,FALSE),\"\")","v":""},{"$f":"IFERROR(VLOOKUP(I16,Shop_01!$A$2:$B$150,2,FALSE),\"\")","v":""}]
[16,"Missing",{"$f":"IFERROR(VLOOKUP(A17,Driver_01!$A$2:$B$150,2,FALSE),\"\")","v":""},{"$f":"IFERROR(VLOOKUP(A17,Driver_02!$A$2:$B$150,2,FALSE),\"\")","v":""},{"$f":"IFERROR(VLOOKUP(A17,Driver_03!$A$2:$B$150,2,FALSE),\"\")","v":""},{"$f":"IFERROR(VLOOKUP(A17,Driver_04!$A$2:$B$150,2,FALSE),\"\")","v":""},{"$f":"IFERROR(VLOOKUP(A17,Shop_01!$A$2:$B$188,2,FALSE),\"\")","v":""},null,216,"Missing",{"$f":"IFERROR(VLOOKUP(I17,Driver_01!$A$2:$B$150,2,FALSE),\"\")","v":""},{"$f":"IFERROR(VLOOKUP(I17,Driver_02!$A$2:$B$150,2,FALSE),\"\")","v":""},{"$f":"IFERROR(VLOOKUP(I17,Driver_03!$A$2:$B$150,2,FALSE),\"\")","v":""},{"$f":"IFERROR(VLOOKUP(I17,Driver_04!$A$2:$B$150,2,FALSE),\"\")","v":""},{"$f":"IFERROR(VLOOKUP(I17,Shop_01!$A$2:$B$150,2,FALSE),\"\")","v":""}]
[17,"Missing",{"$f":"IFERROR(VLOOKUP(A18,Driver_01!$A$2:$B$150,2,FALSE),\"\")","v":""},{"$f":"IFERROR(VLOOKUP(A18,Driver_02!$A$2:$B$150,2,FALSE),\"\")","v":""},{"$f":"IFERROR(VLOOKUP(A18,Driver_03!$A$2:$B$150,2,FALSE),\"\")","v":""},{"$f":"IFERROR(VLOOKUP(A18,Driver_04!$A$2:$B$150,2,FALSE),\"\")","v":""},{"$f":"IFERROR(VLOOKUP(A18,Shop_01!$A$2:$B$188,2,FALSE),\"\")","v":""},null,217,"Missing",{"$f":"IFERROR(VLOOKUP(I18,Driver_01!$A$2:$B$150,2,FALSE),\"\")","v":""},{"$f":"IFERROR(VLOOKUP(I18,Driver_02!$A$2:$B$150,2,FALSE),\"\")","v":""},{"$f":"IFERROR(VLOOKUP(I18,Driver_03!$A$2:$B$150,2,FALSE),\"\")","v":""},{"$f":"IFERROR(VLOOKUP(I18,Driver_04!$A$2:$B$150,2,FALSE),\"\")","v":""},{"$f":"IFERROR(VLOOKUP(I18,Shop_01!$A$2:$B$150,2,FALSE),\"\")","v":""}]
[18,"Missing",null,{"$f":"IFERROR(VLOOKUP(A19,Driver_02!$A$2:$B$150,2,FALSE),\"\")","v":""},{"$f":"IFERROR(VLOOKUP(A19,Driver_03!$A$2:$B$150,2,FALSE),\"\")","v":""},{"$f":"IFERROR(VLOOKUP(A19,Driver_04!$A$2:$B$150,2,FALSE),\"\")","v":""},{"$f":"IFERROR(VLOOKUP(A19,Shop_01!$A$2:$B$188,2,FALSE),\"\")","v":""},null,218,"Missing",{"$f":"IFERROR(VLOOKUP(I19,Driver_01!$A$2:$B$150,2,FALSE),\"\")","v":""},{"$f":"IFERROR(VLOOKUP(I19,Driver_02!$A$2:$B$150,2,FALSE),\"\")","v":""},{"$f":"IFERROR(VLOOKUP(I19,Driver_03!$A$2:$B$150,2,FALSE),\"\")","v":""},{"$f":"IFERROR(VLOOKUP(I19,Driver_04!$A$2:$B$150,2,FALSE),\"\")","v":""},{"$f":"IFERROR(VLOOKUP(I19,Shop_01!$A$2:$B$150,2,FALSE),\"\")","v":""}]
[19,"Missing",{"$f":"IFERROR(VLOOKUP(A20,Driver_01!$A$2:$B$150,2,FALSE),\"\")","v":""},{"$f":"IFERROR(VLOOKUP(A20,Driver_02!$A$2:$B$150,2,FALSE),\"\")","v":""},{"$f":"IFERROR(VLOOKUP(A20,Driver_03!$A$2:$B$150,2,FALSE),\"\")","v":""},{"$f":"IFERROR(VLOOKUP(A20,Driver_04!$A$2:$B$150,2,FALSE),\"\")","v":""},{"$f":"IFERROR(VLOOKUP(A20,Shop_01!$A$2:$B$188,2,FALSE),\"\")","v":""},null,219,"Missing",{"$f":"IFERROR(VLOOKUP(I20,Driver_01!$A$2:$B$150,2,FALSE),\"\")","v":""},{"$f":"IFERROR(VLOOKUP(I20,Driver_02!$A$2:$B$150,2,FALSE),\"\")","v":""},{"$f":"IFERROR(VLOOKUP(I20,Driver_03!$A$2:$B$150,2,FALSE),\"\")","v":""},{"$f":"IFERROR(VLOOKUP(I20,Driver_04!$A$2:$B$150,2,FALSE),\"\")","v":""},{"$f":"IFERROR(VLOOKUP(I20,Shop_01!$A$2:$B$150,2,FALSE),\"\")","v":""}]
{"$rows_left_out":85}
{"sheet":"Driver_01","index":2,"n_rows":40,"n_cols":10,"rows_kept":40,"cut":false,"hidden":false,"merged":[[0,4,0,5]]}
["Ticket No.","Driver_01","Visa","Delivery Charge","Post Code (over£2)",null,"Total Cash= ",{"$f":"IF(B1=\"\",\"\",SUM(B2:B39))","v":0}]
[null,null," ",{"$f":"IF(A2=\"\",\"\",IF(E2<>\"\",F2,1))","v":""},null,null,null,null,null,"Yes"]
[null,null," ",{"$f":"IF(A3=\"\",\"\",IF(E3<>\"\",F3,1))","v":""},null,null,"Total Number of Delivery",{"$f":"COUNT(A2:A39)","v":0},null," "]
[null,null,null,"",null,null,"Delivery Charge",{"$f":"SUM(D2:D39)","v":0}]
[null,null,null,""]
[null,null," ",""]
[null,null," ",""]
[null,null,null,""]
[null,null,null,""]
[null,null," ",""]
[null,null," ",""]
[null,null," ",""]
[null,null," ","",null,null,"Visa = ",{"$f":"SUMIF(C2:C39,\"=yes\",B2:B39)","v":0},{"$f":"COUNTIF(C2:C15,\"yes\")","v":0}]
[null,null," ",""]
[null,null," ",""]
[null,null,null,"",null,null,"Summary"]
[null,null,null,"",null,null,"Driver Name:"]
[null,null,null,"",null,null,"Working Hours:"]
[null,null,null,"",null,null,"Turnover:",{"$f":"H1","v":0}]
[null,null,null,"",null,null,"Cash:",{"$f":"H19-H21","v":0}]
{"$rows_left_out":21}
{"sheet":"Driver_02","index":3,"n_rows":40,"n_cols":10,"rows_kept":40,"cut":false,"hidden":false,"merged":[[0,4,0,5]]}
["Ticket No.","Driver_02","Visa","Delivery Charge","Post Code (over£2)",null,"Total Cash= ",{"$f":"IF(B1=\"\",\"\",SUM(B2:B39))","v":0}]
[null,null," ",{"$f":"IF(A2=\"\",\"\",IF(E2<>\"\",F2,1))","v":""},null,null,null,null,null,"Yes"]
[null,null," ",{"$f":"IF(A3=\"\",\"\",IF(E3<>\"\",F3,1))","v":""},null,null,"Total Number of Delivery",{"$f":"COUNT(A2:A39)","v":0},null," "]
[null,null,null,"",null,null,"Delivery Charge",{"$f":"SUM(D2:D39)","v":0}]
[null,null,null,""]
[null,null," ",""]
[null,null," ",""]
[null,null,null,""]
[null,null,null,""]
[null,null," ",""]
[null,null," ",""]
[null,null," ",""]
[null,null," ","",null,null,"Visa = ",{"$f":"SUMIF(C2:C39,\"=yes\",B2:B39)","v":0},{"$f":"COUNTIF(C2:C15,\"yes\")","v":0}]
[null,null," ",""]
[null,null," ",""]
[null,null,null,"",null,null,"Summary"]
[null,null,null,"",null,null,"Driver Name:"]
[null,null,null,"",null,null,"Working Hours:"]
[null,null,null,"",null,null,"Turnover:",{"$f":"H1","v":0}]
[null,null,null,"",null,null,"Cash:",{"$f":"H19-H21","v":0}]
{"$rows_left_out":21}
{"sheet":"Driver_03","index":4,"n_rows":40,"n_cols":10,"rows_kept":40,"cut":false,"hidden":false,"merged":[[0,4,0,5]]}
["Ticket No.","Driver_01","Visa","Delivery Charge","Post Code (over£2)",null,"Total Cash= ",{"$f":"IF(B1=\"\",\"\",SUM(B2:B39))","v":0}]
[null,null," ",{"$f":"IF(A2=\"\",\"\",IF(E2<>\"\",F2,1))","v":""},null,null,null,null,null,"Yes"]
[null,null," ",{"$f":"IF(A3=\"\",\"\",IF(E3<>\"\",F3,1))","v":""},null,null,"Total Number of Delivery",{"$f":"COUNT(A2:A39)","v":0},null," "]
[null,null,null,"",null,null,"Delivery Charge",{"$f":"SUM(D2:D39)","v":0}]
[null,null,null,""]
[null,null," ",""]
[null,null," ",""]
[null,null,null,""]
[null,null,null,""]
[null,null," ",""]
[null,null," ",""]
[null,null," ",""]
[null,null," ","",null,null,"Visa = ",{"$f":"SUMIF(C2:C39,\"=yes\",B2:B39)","v":0},{"$f":"COUNTIF(C2:C15,\"yes\")","v":0}]
[null,null," ",""]
[null,null," ",""]
[null,null,null,"",null,null,"Summary"]
[null,null,null,"",null,null,"Driver Name:"]
[null,null,null,"",null,null,"Working Hours:"]
[null,null,null,"",null,null,"Turnover:",{"$f":"H1","v":0}]
[null,null,null,"",null,null,"Cash:",{"$f":"H19-H21","v":0}]
{"$rows_left_out":21}
{"sheet":"Driver_04","index":5,"n_rows":40,"n_cols":10,"rows_kept":40,"cut":false,"hidden":false,"merged":[[0,4,0,5]]}
["Ticket No.","Driver_01","Visa","Delivery Charge","Post Code (over£2)",null,"Total Cash= ",{"$f":"IF(B1=\"\",\"\",SUM(B2:B39))","v":0}]
[null,null," ",{"$f":"IF(A2=\"\",\"\",IF(E2<>\"\",F2,1))","v":""},null,null,null,null,null,"Yes"]
[null,null," ",{"$f":"IF(A3=\"\",\"\",IF(E3<>\"\",F3,1))","v":""},null,null,"Total Number of Delivery",{"$f":"COUNT(A2:A39)","v":0},null," "]
[null,null,null,"",null,null,"Delivery Charge",{"$f":"SUM(D2:D39)","v":0}]
[null,null,null,""]
[null,null," ",""]
[null,null," ",""]
[null,null,null,""]
[null,null,null,""]
[null,null," ",""]
[null,null," ",""]
[null,null," ",""]
[null,null," ","",null,null,"Visa = ",{"$f":"SUMIF(C2:C39,\"=yes\",B2:B39)","v":0},{"$f":"COUNTIF(C2:C15,\"yes\")","v":0}]
[null,null," ",""]
[null,null," ",""]
[null,null,null,"",null,null,"Summary"]
[null,null,null,"",null,null,"Driver Name:"]
[null,null,null,"",null,null,"Working Hours:"]
[null,null,null,"",null,null,"Turnover:",{"$f":"H1","v":0}]
[null,null,null,"",null,null,"Cash:",{"$f":"H19-H21","v":0}]
{"$rows_left_out":21}
{"sheet":"Shop_01","index":6,"n_rows":93,"n_cols":11,"rows_kept":93,"cut":false,"hidden":false,"merged":[]}
["Ticket No.","Shop","Visa",null,null,"Total = ",{"$f":"IF(B1=\"\",\"\",SUM(B2:B91))","v":0}]
[]
[]
[]
[]
[]
[]
[]
[]
[]
[null,null,null,null,null,null,null,null,null,null," "]
[]
[]
[]
[]
[]
[]
[]
[]
[]
{"$rows_left_out":74}
{"sheet":"Summary","index":7,"n_rows":10,"n_cols":5,"rows_kept":10,"cut":false,"hidden":false,"merged":[]}
[]
[]
[null,null,{"$f":"TODAY()","v":"2018-09-29"}]
[]
[]
[null,null,"Delivery",{"$f":"SUM('General Tickets'!C2:F301)","v":0},{"$f":"COUNT('General Tickets'!C2:F301)","v":0}]
[null,null,"Shop",{"$f":"SUM('General Tickets'!G2:G301)","v":0},{"$f":"COUNT('General Tickets'!G2:G301)","v":0}]
[]
[]
[null,null,"Grand Total",{"$f":"SUM(D6:D8)","v":0}]

{"sheet":"Checking","index":8,"n_rows":21,"n_cols":21,"rows_kept":21,"cut":false,"hidden":false,"merged":[[6,2,6,3],[6,4,6,5],[6,14,6,15],[6,16,6,17],[27,14,27,15],[27,16,27,17]]}
[]
[null,"Business Turnover",{"$f":"Summary!D7","v":0},null,null,null,null,null,null,null,null,null,null,"Turnover"]
[null,"Cash Flow",273,null,null,null,null,null,null,null,null,null,null,"Cash Flow"]
[null,"Shopping",0,null,null,null,null,null,null,null,null,null,null,"Shopping"]
[null,"Total =",{"$f":"SUM(C2:C3)-C4","v":273},null,null,null,null,null,null,null,null,null,null,"Total ="]
[]
[null,null,"Till",null,"Bag",null,null,null,null,null,null,null,null,null,"Till",null,"Bag",null,"D_01","D_02","D_03"]
[null,50,null,{"$f":"C8*B8","v":0},null,{"$f":"E8*B8","v":0},null,null,null,null,null,null,null,50]
[null,20,null,{"$f":"C9*B9","v":0},null,0,null,null,null,null,null,null,null,20,null,null,null,{"$f":"Q9*N9","v":0}]
[null,10,null,0,5,50,null,null,null,null,null,null,null,10,null,null,null,0]
[null,5,null,0,20,100,null,null,null,null,null,null,null,5,null,null,null,0]
[null,1,null,{"$f":"C12*B12","v":0},80,{"$f":"E12*B12","v":80},null,null,null,null,null,null,null,1,null,null,null,0]
[null,0.5,null,{"$f":"C13*B13","v":0},20,{"$f":"E13*B13","v":10},null,null,null,null,null,null,null,0.5,null,null,null,0]
[null,0.2,null,{"$f":"C14*B14","v":0},50,{"$f":"E14*B14","v":10},null,null,null,null,null,null,null,0.2,null,null,null,0]
[null,0.1,null,{"$f":"C15*B15","v":0},30,{"$f":"E15*B15","v":3},null,null,null,null,null,null,null,0.1,null,null,null,0]
[null,"VISA",null,{"$f":"C16","v":0},null,null,null,null,null,null,null,null,null,0.05,null,null,null,0]
[]
[null,null,{"$f":"SUM(G8:G16)","v":0},{"$f":"SUM(D8:D16)","v":0},null,{"$f":"SUM(F8:F16)","v":253},null,null,null,null,null,null,null,null,null,{"$f":"SUM(P8:P16)","v":0},null,{"$f":"SUM(R8:R16)","v":0}]
[null,"Total =",{"$f":"SUM(C18:F18)","v":253},null,null,null,null,null,null,null,null,null,null,"Total ="]
[null,"Error",{"$f":"C5-C19","v":20},null,null,null,null,null,null,null,null,null,null,"Error"]
{"$rows_left_out":1}