{"text_format":"1","workbook":"xlsx","n_sheets":9,"sheets":["Home","General Tickets","Driver_01","Driver_02","Driver_03","Driver_04","Shop_01","Summary","Checking"],"not_rendered":{"charts":0,"images":0,"macros":1,"external_links":0,"defined_names":2,"comments":0,"pivot_tables":0},"unopened":[],"bounds":{"document_bytes":16777216,"sheet_cells":100000,"rows_first":2000,"rows_last":500,"rows_between":2000,"halvings":0,"cell_chars":16384,"cell_head_chars":4096},"cells_cut":0,"cells_raw":0,"read":"whole","date_system":"1900"}

{"sheet":"Home","index":0,"n_rows":0,"n_cols":0,"rows_kept":0,"cut":false,"hidden":false,"merged":[]}

{"sheet":"General Tickets","index":1,"n_rows":104,"n_cols":15,"rows_kept":104,"cut":false,"hidden":false,"merged":[[0,0,0,1],[0,8,0,9]]}
["PC _ 01",null,"Driver_01","Driver_02","Driver_03","Driver_04","Shop_01",null,"PC _ 02",null,"Driver_01","Driver_02","Driver_03","Driver_04","Shop_01"]
[1,{"$f":"IF(SUM(C2:G2)<0.5,\"Missing\",SUM(C2:G2))","v":"Missing"},{"$f":"IFERROR(VLOOKUP(A2,Driver_01!$A$2:$B$150,2,FALSE),\"\")","v":""},{"$f":"IFERROR(VLOOKUP(A2,Driver_02!$A$2:$B$150,2,FALSE),\"\")","v":""},{"$f":"IFERROR(VLOOKUP(A2,Driver_03!$A$2:$B$150,2,FALSE),\"\")","v":""},{"$f":"IFERROR(VLOOKUP(A2,Driver_04!$A$2:$B$150,2,FALSE),\"\")","v":""},{"$f":"IFERROR(VLOOKUP(A2,Shop_01!$A$2:$B$188,2,FALSE),\"\")","v":""},null,201,{"$f":"IF(SUM(K2:O2)<0.5,\"Missing\",SUM(K2:O2))","v":"Missing"},{"$f":"IFERROR(VLOOKUP(I2,Driver_01!$A$2:$B$150,2,FALSE),\"\")","v":""},{"$f":"IFERROR(VLOOKUP(I2,Driver_02!$A$2:$B$150,2,FALSE),\"\")","v":""},{"$f":"IFERROR(VLOOKUP(I2,Driver_03!$A$2:$B$150,2,FALSE),\"\")","v":""},{"$f":"IFERROR(VLOOKUP(I2,Driver_04!$A$2:$B$150,2,FALSE),\"\")","v":""},{"$f":"IFERROR(VLOOKUP(I2,Shop_01!$A$2:$B$150,2,FALSE),\"\")","v":""}]
[{"$f":"A2+1","v":2},"Missing",{"$f":"IFERROR(VLOOKUP(A3,Driver_01!$A$2:$B$150,2,FALSE),\"\")","v":""},{"$f":"IFERROR(VLOOKUP(A3,Driver_02!$A$2:$B$150,2,FALSE),\"\")","v":""},{"$f":"IFERROR(VLOOKUP(A3,Driver_03!$A$2:$B$150,2,FALSE),\"\")","v":""},{"$f":"IFERROR(VLOOKUP(A3,Driver_04!$A$2:$B$150,2,FALSE),\"\")","v":""},{"$f":"IFERROR(VLOOKUP(A3,Shop_01!$A$2:$B$188,2,FALSE),\"\")","v":""},null,{"$f":"I2+1","v":202},"Missing",{"$f":"IFERROR(VLOOKUP(I3,Driver_01!$A$2:$B$150,2,FALSE),\"\")","v":""},{"$f":"IFERROR(VLOOKUP(I3,Driver_02!$A$2:$B$150,2,FALSE),\"\")","v":""},{"$f":"IFERROR(VLOOKUP(I3,Driver_03!$A$2:$B$150,2,FALSE),\"\")","v":""},{"$f":"IFERROR(VLOOKUP(I3,Driver_04!$A$2:$B$150,2,FALSE),\"\")","v":""},{"$f":"IFERROR(VLOOKUP(I3,Shop_01!$A$2:$B$150,2,FALSE),\"\")","v":""}]
[{"$f":"A3+1","v":3},"Missing",{"$f":"IFERROR(VLOOKUP(A4,Driver_01!$A$2:$B$150,2,FALSE),\"\")","v":""},{"$f":"IFERROR(VLOOKUP(A4,Driver_02!$A$2:$B$150,2,FALSE),\"\")","v":""},{"$f":"IFERROR(VLOOKUP(A4,Driver_03!$A$2:$B$150,2,FALSE),\"\")","v":""},{"$f":"IFERROR(VLOOKUP(A4,Driver_04!$A$2:$B$150,2,FALSE),\"\")","v":""},{"$f":"IFERROR(VLOOKUP(A4,Shop_01!$A$2:$B$188,2,FALSE),\"\")","v":""},null,{"$f":"I3+1","v":203},"Missing",{"$f":"IFERROR(VLOOKUP(I4,Driver_01!$A$2:$B$150,2,FALSE),\"\")","v":""},{"$f":"IFERROR(VLOOKUP(I4,Driver_02!$A$2:$B$150,2,FALSE),\"\")","v":""},{"$f":"IFERROR(VLOOKUP(I4,Driver_03!$A$2:$B$150,2,FALSE),\"\")","v":""},{"$f":"IFERROR(VLOOKUP(I4,Driver_04!$A$2:$B$150,2,FALSE),\"\")","v":""},{"$f":"IFERROR(VLOOKUP(I4,Shop_01!$A$2:$B$150,2,FALSE),\"\")","v":""}]
[4,{"$f":"IF(SUM(C5:G5)<0.5,\"Missing\",SUM(C5:G5))","v":"Missing"},{"$f":"IFERROR(VLOOKUP(A5,Driver_01!$A$2:$B$150,2,FALSE),\"\")","v":""},{"$f":"IFERROR(VLOOKUP(A5,Driver_02!$A$2:$B$150,2,FALSE),\"\")","v":""},{"$f":"IFERROR(VLOOKUP(A5,Driver_03!$A$2:$B$150,2,FALSE),\"\")","v":""},{"$f":"IFERROR(VLOOKUP(A5,Driver_04!$A$2:$B$150,2,FALSE),\"\")","v":""},{"$f":"IFERROR(VLOOKUP(A5,Shop_01!$A$2:$B$188,2,FALSE),\"\")","v":""},null,204,"Missing",{"$f":"IFERROR(VLOOKUP(I5,Driver_01!$A$2:$B$150,2,FALSE),\"\")","v":""},{"$f":"IFERROR(VLOOKUP(I5,Driver_02!$A$2:$B$150,2,FALSE),\"\")","v":""},{"$f":"IFERROR(VLOOKUP(I5,Driver_03!$A$2:$B$150,2,FALSE),\"\")","v":""},{"$f":"IFERROR(VLOOKUP(I5,Driver_04!$A$2:$B$150,2,FALSE),\"\")","v":""},{"$f":"IFERROR(VLOOKUP(I5,Shop_01!$A$2:$B$150,2,FALSE),\"\")","v":""}]
[5,{"$f":"IF(SUM(C6:G6)<0.5,\"Missing\",SUM(C6:G6))","v":"Missing"},{"$f":"IFERROR(VLOOKUP(A6,Driver_01!$A$2:$B$150,2,FALSE),\"\")","v":""},{"$f":"IFERROR(VLOOKUP(A6,Driver_02!$A$2:$B$150,2,FALSE),\"\")","v":""},{"$f":"IFERROR(VLOOKUP(A6,Driver_03!$A$2:$B$150,2,FALSE),\"\")","v":""},{"$f":"IFERROR(VLOOKUP(A6,Driver_04!$A$2:$B$150,2,FALSE),\"\")","v":""},{"$f":"IFERROR(VLOOKUP(A6,Shop_01!$A$2:$B$188,2,FALSE),\"\")","v":""},null,205,"Missing",{"$f":"IFERROR(VLOOKUP(I6,Driver_01!$A$2:$B$150,2,FALSE),\"\")","v":""},{"$f":"IFERROR(VLOOKUP(I6,Driver_02!$A$2:$B$150,2,FALSE),\"\")","v":""},{"$f":"IFERROR(VLOOKUP(I6,Driver_03!$A$2:$B$150,2,FALSE),\"\")","v":""},{"$f":"IFERROR(VLOOKUP(I6,Driver_04!$A$2:$B$150,2,FALSE),\"\")","v":""},{"$f":"IFERROR(VLOOKUP(I6,Shop_01!$A$2:$B$150,2,FALSE),\"\")","v":""}]
[6,"Missing",{"$f":"IFERROR(VLOOKUP(A7,Driver_01!$A$2:$B$150,2,FALSE),\"\")","v":""},{"$f":"IFERROR(VLOOKUP(A7,Driver_02!$A$2:$B$150,2,FALSE),\"\")","v":""},{"$f":"IFERROR(VLOOKUP(A7,Driver_03!$A$2:$B$150,2,FALSE),\"\")","v":""},{"$f":"IFERROR(VLOOKUP(A7,Driver_04!$A$2:$B$150,2,FALSE),\"\")","v":""},{"$f":"IFERROR(VLOOKUP(A7,Shop_01!$A$2:$B$188,2,FALSE),\"\")","v":""},null,206,"Missing",{"$f":"IFERROR(VLOOKUP(I7,Driver_01!$A$2:$B$150,2,FALSE),\"\")","v":""},{"$f":"IFERROR(VLOOKUP(I7,Driver_02!$A$2:$B$150,2,FALSE),\"\")","v":""},{"$f":"IFERROR(VLOOKUP(I7,Driver_03!$A$2:$B$150,2,FALSE),\"\")","v":""},{"$f":"IFERROR(VLOOKUP(I7,Driver_04!$A$2:$B$150,2,FALSE),\"\")","v":""},{"$f":"IFERROR(VLOOKUP(I7,Shop_01!$A$2:$B$150,2,FALSE),\"\")","v":""}]
[7,"Missing",{"$f":"IFERROR(VLOOKUP(A8,Driver_01!$A$2:$B$150,2,FALSE),\"\")","v":""},{"$f":"IFERROR(VLOOKUP(A8,Driver_02!$A$2:$B$150,2,FALSE),\"\")","v":""},{"$f":"IFERROR(VLOOKUP(A8,Driver_03!$A$2:$B$150,2,FALSE),\"\")","v":""},{"$f":"IFERROR(VLOOKUP(A8,Driver_04!$A$2:$B$150,2,FALSE),\"\")","v":""},{"$f":"IFERROR(VLOOKUP(A8,Shop_01!$A$2:$B$188,2,FALSE),\"\")","v":""},null,207,"Missing",{"$f":"IFERROR(VLOOKUP(I8,Driver_01!$A$2:$B$150,2,FALSE),\"\")","v":""},{"$f":"IFERROR(VLOOKUP(I8,Driver_02!$A$2:$B$150,2,FALSE),\"\")","v":""},{"$f":"IFERROR(VLOOKUP(I8,Driver_03!$A$2:$B$150,2,FALSE),\"\")","v":""},{"$f":"IFERROR(VLOOKUP(I8,Driver_04!$A$2:$B$150,2,FALSE),\"\")","v":""},{"$f":"IFERROR(VLOOKUP(I8,Shop_01!$A$2:$B$150,2,FALSE),\"\")","v":""}]
[8,"Missing",{"$f":"IFERROR(VLOOKUP(A9,Driver_01!$A$2:$B$150,2,FALSE),\"\")","v":""},{"$f":"IFERROR(VLOOKUP(A9,Driver_02!$A$2:$B$150,2,FALSE),\"\")","v":""},{"$f":"IFERROR(VLOOKUP(A9,Driver_03!$A$2:$B$150,2,FALSE),\"\")","v":""},{"$f":"IFERROR(VLOOKUP(A9,Driver_04!$A$2:$B$150,2,FALSE),\"\")","v":""},{"$f":"IFERROR(VLOOKUP(A9,Shop_01!$A$2:$B$188,2,FALSE),\"\")","v":""},null,208,"Missing",{"$f":"IFERROR(VLOOKUP(I9,Driver_01!$A$2:$B$150,2,FALSE),\"\")","v":""},{"$f":"IFERROR(VLOOKUP(I9,Driver_02!$A$2:$B$150,2,FALSE),\"\")","v":""},{"$f":"IFERROR(VLOOKUP(I9,Driver_03!$A$2:$B$150,2,FALSE),\"\")","v":""},{"$f":"IFERROR(VLOOKUP(I9,Driver_04!$A$2:$B$150,2,FALSE),\"\")","v":""},{"$f":"IFERROR(VLOOKUP(I9,Shop_01!$A$2:$B$150,2,FALSE),\"\")","v":""}]
[9,"Missing",{"$f":"IFERROR(VLOOKUP(A10,Driver_01!$A$2:$B$150,2,FALSE),\"\")","v":""},{"$f":"IFERROR(VLOOKUP(A10,Driver_02!$A$2:$B$150,2,FALSE),\"\")","v":""},{"$f":"IFERROR(VLOOKUP(A10,Driver_03!$A$2:$B$150,2,FALSE),\"\")","v":""},{"$f":"IFERROR(VLOOKUP(A10,Driver_04!$A$2:$B$150,2,FALSE),\"\")","v":""},{"$f":"IFERROR(VLOOKUP(A10,Shop_01!$A$2:$B$188,2,FALSE),\"\")","v":""},null,209,"Missing",{"$f":"IFERROR(VLOOKUP(I10,Driver_01!$A$2:$B$150,2,FALSE),\"\")","v":""},{"$f":"IFERROR(VLOOKUP(I10,Driver_02!$A$2:$B$150,2,FALSE),\"\")","v":""},{"$f":"IFERROR(VLOOKUP(I10,Driver_03!$A$2:$B$150,2,FALSE),\"\")","v":""},{"$f":"IFERROR(VLOOKUP(I10,Driver_04!$A$2:$B$150,2,FALSE),\"\")","v":""},{"$f":"IFERROR(VLOOKUP(I10,Shop_01!$A$2:$B$150,2,FALSE),\"\")","v":""}]
[10,"Missing",{"$f":"IFERROR(VLOOKUP(A11,Driver_01!$A$2:$B$150,2,FALSE),\"\")","v":""},{"$f":"IFERROR(VLOOKUP(A11,Driver_02!$A$2:$B$150,2,FALSE),\"\")","v":""},{"$f":"IFERROR(VLOOKUP(A11,Driver_03!$A$2:$B$150,2,FALSE),\"\")","v":""},{"$f":"IFERROR(VLOOKUP(A11,Driver_04!$A$2:$B$150,2,FALSE),\"\")","v":""},{"$f":"IFERROR(VLOOKUP(A11,Shop_01!$A$2:$B$188,2,FALSE),\"\")","v":""},null,210,"Missing",{"$f":"IFERROR(VLOOKUP(I11,Driver_01!$A$2:$B$150,2,FALSE),\"\")","v":""},{"$f":"IFERROR(VLOOKUP(I11,Driver_02!$A$2:$B$150,2,FALSE),\"\")","v":""},{"$f":"IFERROR(VLOOKUP(I11,Driver_03!$A$2:$B$150,2,FALSE),\"\")","v":""},{"$f":"IFERROR(VLOOKUP(I11,Driver_04!$A$2:$B$150,2,FALSE),\"\")","v":""},{"$f":"IFERROR(VLOOKUP(I11,Shop_01!$A$2:$B$150,2,FALSE),\"\")","v":""}]
[11,"Missing",{"$f":"IFERROR(VLOOKUP(A12,Driver_01!$A$2:$B$150,2,FALSE),\"\")","v":""},{"$f":"IFERROR(VLOOKUP(A12,Driver_02!$A$2:$B$150,2,FALSE),\"\")","v":""},{"$f":"IFERROR(VLOOKUP(A12,Driver_03!$A$2:$B$150,2,FALSE),\"\")","v":""},{"$f":"IFERROR(VLOOKUP(A12,Driver_04!$A$2:$B$150,2,FALSE),\"\")","v":""},{"$f":"IFERROR(VLOOKUP(A12,Shop_01!$A$2:$B$188,2,FALSE),\"\")","v":""},null,211,"Missing",{"$f":"IFERROR(VLOOKUP(I12,Driver_01!$A$2:$B$150,2,FALSE),\"\")","v":""},{"$f":"IFERROR(VLOOKUP(I12,Driver_02!$A$2:$B$150,2,FALSE),\"\")","v":""},{"$f":"IFERROR(VLOOKUP(I12,Driver_03!$A$2:$B$150,2,FALSE),\"\")","v":""},{"$f":"IFERROR(VLOOKUP(I12,Driver_04!$A$2:$B$150,2,FALSE),\"\")","v":""},{"$f":"IFERROR(VLOOKUP(I12,Shop_01!$A$2:$B$150,2,FALSE),\"\")","v":""}]
[12,"Missing",{"$f":"IFERROR(VLOOKUP(A13,Driver_01!$A$2:$B$150,2,FALSE),\"\")","v":""},{"$f":"IFERROR(VLOOKUP(A13,Driver_02!$A$2:$B$150,2,FALSE),\"\")","v":""},{"$f":"IFERROR(VLOOKUP(A13,Driver_03!$A$2:$B$150,2,FALSE),\"\")","v":""},{"$f":"IFERROR(VLOOKUP(A13,Driver_04!$A$2:$B$150,2,FALSE),\"\")","v":""},{"$f":"IFERROR(VLOOKUP(A13,Shop_01!$A$2:$B$188,2,FALSE),\"\")","v":""},null,212,"Missing",{"$f":"IFERROR(VLOOKUP(I13,Driver_01!$A$2:$B$150,2,FALSE),\"\")","v":""},{"$f":"IFERROR(VLOOKUP(I13,Driver_02!$A$2:$B$150,2,FALSE),\"\")","v":""},{"$f":"IFERROR(VLOOKUP(I13,Driver_03!$A$2:$B$150,2,FALSE),\"\")","v":""},{"$f":"IFERROR(VLOOKUP(I13,Driver_04!$A$2:$B$150,2,FALSE),\"\")","v":""},{"$f":"IFERROR(VLOOKUP(I13,Shop_01!$A$2:$B$150,2,FALSE),\"\")","v":""}]
[13,"Missing",{"$f":"IFERROR(VLOOKUP(A14,Driver_01!$A$2:$B$150,2,FALSE),\"\")","v":""},{"$f":"IFERROR(VLOOKUP(A14,Driver_02!$A$2:$B$150,2,FALSE),\"\")","v":""},{"$f":"IFERROR(VLOOKUP(A14,Driver_03!$A$2:$B$150,2,FALSE),\"\")","v":""},{"$f":"IFERROR(VLOOKUP(A14,Driver_04!$A$2:$B$150,2,FALSE),\"\")","v":""},{"$f":"IFERROR(VLOOKUP(A14,Shop_01!$A$2:$B$188,2,FALSE),\"\")","v":""},null,213,"Missing",{"$f":"IFERROR(VLOOKUP(I14,Driver_01!$A$2:$B$150,2,FALSE),\"\")","v":""},{"$f":"IFERROR(VLOOKUP(I14,Driver_02!$A$2:$B$150,2,FALSE),\"\")","v":""},{"$f":"IFERROR(VLOOKUP(I14,Driver_03!$A$2:$B$150,2,FALSE),\"\")","v":""},{"$f":"IFERROR(VLOOKUP(I14,Driver_04!$A$2:$B$150,2,FALSE),\"\")","v":""},{"$f":"IFERROR(VLOOKUP(I14,Shop_01!$A$2:$B$150,2,FALSE),\"\")","v":""}]
[14,"Missing",{"$f":"IFERROR(VLOOKUP(A15,Driver_01!$A$2:$B$150,2,FALSE),\"\")","v":""},{"$f":"IFERROR(VLOOKUP(A15,Driver_02!$A$2:$B$150,2,FALSE),\"\")","v":""},{"$f":"IFERROR(VLOOKUP(A15,Driver_03!$A$2:$B$150,2,FALSE),\"\")","v":""},{"$f":"IFERROR(VLOOKUP(A15,Driver_04!$A$2:$B$150,2,FALSE),\"\")","v":""},{"$f":"IFERROR(VLOOKUP(A15,Shop_01!$A$2:$B$188,2,FALSE),\"\")","v":""},null,214,"Missing",{"$f":"IFERROR(VLOOKUP(I15,Driver_01!$A$2:$B$150,2,FALSE),\"\")","v":""},{"$f":"IFERROR(VLOOKUP(I15,Driver_02!$A$2:$B$150,2,FALSE),\"\")","v":""},{"$f":"IFERROR(VLOOKUP(I15,Driver_03!$A$2:$B$150,2,FALSE),\"\")","v":""},{"$f":"IFERROR(VLOOKUP(I15,Driver_04!$A$2:$B$150,2,FALSE),\"\")","v":""},{"$f":"IFERROR(VLOOKUP(I15,Shop_01!$A$2:$B$150,2,FALSE),\"\")","v":""}]
[15,"Missing",null,{"$f":"IFERROR(VLOOKUP(A16,Driver_02!$A$2:$B$150,2,FALSE),\"\")","v":""},{"$f":"IFERROR(VLOOKUP(A16,Driver_03!$A$2:$B$150,2,FALSE),\"\")","v":""},{"$f":"IFERROR(VLOOKUP(A16,Driver_04!$A$2:$B$150,2,FALSE),\"\")","v":""},{"$f":"IFERROR(VLOOKUP(A16,Shop_01!$A$2:$B$188,2,FALSE),\"\")","v":""},null,215,"Missing",{"$f":"IFERROR(VLOOKUP(I16,Driver_01!$A$2:$B$150,2,FALSE),\"\")","v":""},{"$f":"IFERROR(VLOOKUP(I16,Driver_02!$A$2:$B$150,2,FALSE),\"\")","v":""},{"$f":"IFERROR(VLOOKUP(I16,Driver_03!$A$2:$B$150,2,FALSE),\"\")","v":""},{"$f":"IFERROR(VLOOKUP(I16,Driver_04!$A$2:$B$150,2,FALSE),\"\")","v":""},{"$f":"IFERROR(VLOOKUP(I16,Shop_01!$A$2:$B$150,2,FALSE),\"\")","v":""}]
[16,"Missing",{"$f":"IFERROR(VLOOKUP(A17,Driver_01!$A$2:$B$150,2,FALSE),\"\")","v":""},{"$f":"IFERROR(VLOOKUP(A17,Driver_02!$A$2:$B$150,2,FALSE),\"\")","v":""},{"$f":"IFERROR(VLOOKUP(A17,Driver_03!$A$2:$B$150,2,FALSE),\"\")","v":""},{"$f":"IFERROR(VLOOKUP(A17,Driver_04!$A$2:$B$150,2,FALSE),\"\")","v":""},{"$f":"IFERROR(VLOOKUP(A17,Shop_01!$A$2:$B$188,2,FALSE),\"\")","v":""},null,216,"Missing",{"$f":"IFERROR(VLOOKUP(I17,Driver_01!$A$2:$B$150,2,FALSE),\"\")","v":""},{"$f":"IFERROR(VLOOKUP(I17,Driver_02!$A$2:$B$150,2,FALSE),\"\")","v":""},{"$f":"IFERROR(VLOOKUP(I17,Driver_03!$A$2:$B$150,2,FALSE),\"\")","v":""},{"$f":"IFERROR(VLOOKUP(I17,Driver_04!$A$2:$B$150,2,FALSE),\"\")","v":""},{"$f":"IFERROR(VLOOKUP(I17,Shop_01!$A$2:$B$150,2,FALSE),\"\")","v":""}]
[17,"Missing",{"$f":"IFERROR(VLOOKUP(A18,Driver_01!$A$2:$B$150,2,FALSE),\"\")","v":""},{"$f":"IFERROR(VLOOKUP(A18,Driver_02!$A$2:$B$150,2,FALSE),\"\")","v":""},{"$f":"IFERROR(VLOOKUP(A18,Driver_03!$A$2:$B$150,2,FALSE),\"\")","v":""},{"$f":"IFERROR(VLOOKUP(A18,Driver_04!$A$2:$B$150,2,FALSE),\"\")","v":""},{"$f":"IFERROR(VLOOKUP(A18,Shop_01!$A$2:$B$188,2,FALSE),\"\")","v":""},null,217,"Missing",{"$f":"IFERROR(VLOOKUP(I18,Driver_01!$A$2:$B$150,2,FALSE),\"\")","v":""},{"$f":"IFERROR(VLOOKUP(I18,Driver_02!$A$2:$B$150,2,FALSE),\"\")","v":""},{"$f":"IFERROR(VLOOKUP(I18,Driver_03!$A$2:$B$150,2,FALSE),\"\")","v":""},{"$f":"IFERROR(VLOOKUP(I18,Driver_04!$A$2:$B$150,2,FALSE),\"\")","v":""},{"$f":"IFERROR(VLOOKUP(I18,Shop_01!$A$2:$B$150,2,FALSE),\"\")","v":""}]
[18,"Missing",null,{"$f":"IFERROR(VLOOKUP(A19,Driver_02!$A$2:$B$150,2,FALSE),\"\")","v":""},{"$f":"IFERROR(VLOOKUP(A19,Driver_03!$A$2:$B$150,2,FALSE),\"\")","v":""},{"$f":"IFERROR(VLOOKUP(A19,Driver_04!$A$2:$B$150,2,FALSE),\"\")","v":""},{"$f":"IFERROR(VLOOKUP(A19,Shop_01!$A$2:$B$188,2,FALSE),\"\")","v":""},null,218,"Missing",{"$f":"IFERROR(VLOOKUP(I19,Driver_01!$A$2:$B$150,2,FALSE),\"\")","v":""},{"$f":"IFERROR(VLOOKUP(I19,Driver_02!$A$2:$B$150,2,FALSE),\"\")","v":""},{"$f":"IFERROR(VLOOKUP(I19,Driver_03!$A$2:$B$150,2,FALSE),\"\")","v":""},{"$f":"IFERROR(VLOOKUP(I19,Driver_04!$A$2:$B$150,2,FALSE),\"\")","v":""},{"$f":"IFERROR(VLOOKUP(I19,Shop_01!$A$2:$B$150,2,FALSE),\"\")","v":""}]
[19,"Missing",{"$f":"IFERROR(VLOOKUP(A20,Driver_01!$A$2:$B$150,2,FALSE),\"\")","v":""},{"$f":"IFERROR(VLOOKUP(A20,Driver_02!$A$2:$B$150,2,FALSE),\"\")","v":""},{"$f":"IFERROR(VLOOKUP(A20,Driver_03!$A$2:$B$150,2,FALSE),\"\")","v":""},{"$f":"IFERROR(VLOOKUP(A20,Driver_04!$A$2:$B$150,2,FALSE),\"\")","v":""},{"$f":"IFERROR(VLOOKUP(A20,Shop_01!$A$2:$B$188,2,FALSE),\"\")","v":""},null,219,"Missing",{"$f":"IFERROR(VLOOKUP(I20,Driver_01!$A$2:$B$150,2,FALSE),\"\")","v":""},{"$f":"IFERROR(VLOOKUP(I20,Driver_02!$A$2:$B$150,2,FALSE),\"\")","v":""},{"$f":"IFERROR(VLOOKUP(I20,Driver_03!$A$2:$B$150,2,FALSE),\"\")","v":""},{"$f":"IFERROR(VLOOKUP(I20,Driver_04!$A$2:$B$150,2,FALSE),\"\")","v":""},{"$f":"IFERROR(VLOOKUP(I20,Shop_01!$A$2:$B$150,2,FALSE),\"\")","v":""}]
[20,"Missing",null,{"$f":"IFERROR(VLOOKUP(A21,Driver_02!$A$2:$B$150,2,FALSE),\"\")","v":""},{"$f":"IFERROR(VLOOKUP(A21,Driver_03!$A$2:$B$150,2,FALSE),\"\")","v":""},{"$f":"IFERROR(VLOOKUP(A21,Driver_04!$A$2:$B$150,2,FALSE),\"\")","v":""},{"$f":"IFERROR(VLOOKUP(A21,Shop_01!$A$2:$B$188,2,FALSE),\"\")","v":""},null,220,"Missing",{"$f":"IFERROR(VLOOKUP(I21,Driver_01!$A$2:$B$150,2,FALSE),\"\")","v":""},{"$f":"IFERROR(VLOOKUP(I21,Driver_02!$A$2:$B$150,2,FALSE),\"\")","v":""},{"$f":"IFERROR(VLOOKUP(I21,Driver_03!$A$2:$B$150,2,FALSE),\"\")","v":""},{"$f":"IFERROR(VLOOKUP(I21,Driver_04!$A$2:$B$150,2,FALSE),\"\")","v":""},{"$f":"IFERROR(VLOOKUP(I21,Shop_01!$A$2:$B$150,2,FALSE),\"\")","v":""}]
[21,"Missing",{"$f":"IFERROR(VLOOKUP(A22,Driver_01!$A$2:$B$150,2,FALSE),\"\")","v":""},{"$f":"IFERROR(VLOOKUP(A22,Driver_02!$A$2:$B$150,2,FALSE),\"\")","v":""},{"$f":"IFERROR(VLOOKUP(A22,Driver_03!$A$2:$B$150,2,FALSE),\"\")","v":""},{"$f":"IFERROR(VLOOKUP(A22,Driver_04!$A$2:$B$150,2,FALSE),\"\")","v":""},{"$f":"IFERROR(VLOOKUP(A22,Shop_01!$A$2:$B$188,2,FALSE),\"\")","v":""},null,221,"Missing",{"$f":"IFERROR(VLOOKUP(I22,Driver_01!$A$2:$B$150,2,FALSE),\"\")","v":""},{"$f":"IFERROR(VLOOKUP(I22,Driver_02!$A$2:$B$150,2,FALSE),\"\")","v":""},{"$f":"IFERROR(VLOOKUP(I22,Driver_03!$A$2:$B$150,2,FALSE),\"\")","v":""},{"$f":"IFERROR(VLOOKUP(I22,Driver_04!$A$2:$B$150,2,FALSE),\"\")","v":""},{"$f":"IFERROR(VLOOKUP(I22,Shop_01!$A$2:$B$150,2,FALSE),\"\")","v":""}]
[22,"Missing",{"$f":"IFERROR(VLOOKUP(A23,Driver_01!$A$2:$B$150,2,FALSE),\"\")","v":""},{"$f":"IFERROR(VLOOKUP(A23,Driver_02!$A$2:$B$150,2,FALSE),\"\")","v":""},{"$f":"IFERROR(VLOOKUP(A23,Driver_03!$A$2:$B$150,2,FALSE),\"\")","v":""},{"$f":"IFERROR(VLOOKUP(A23,Driver_04!$A$2:$B$150,2,FALSE),\"\")","v":""},{"$f":"IFERROR(VLOOKUP(A23,Shop_01!$A$2:$B$188,2,FALSE),\"\")","v":""},null,222,"Missing",{"$f":"IFERROR(VLOOKUP(I23,Driver_01!$A$2:$B$150,2,FALSE),\"\")","v":""},{"$f":"IFERROR(VLOOKUP(I23,Driver_02!$A$2:$B$150,2,FALSE),\"\")","v":""},{"$f":"IFERROR(VLOOKUP(I23,Driver_03!$A$2:$B$150,2,FALSE),\"\")","v":""},{"$f":"IFERROR(VLOOKUP(I23,Driver_04!$A$2:$B$150,2,FALSE),\"\")","v":""},{"$f":"IFERROR(VLOOKUP(I23,Shop_01!$A$2:$B$150,2,FALSE),\"\")","v":""}]
[23,"Missing",null,{"$f":"IFERROR(VLOOKUP(A24,Driver_02!$A$2:$B$150,2,FALSE),\"\")","v":""},{"$f":"IFERROR(VLOOKUP(A24,Driver_03!$A$2:$B$150,2,FALSE),\"\")","v":""},{"$f":"IFERROR(VLOOKUP(A24,Driver_04!$A$2:$B$150,2,FALSE),\"\")","v":""},{"$f":"IFERROR(VLOOKUP(A24,Shop_01!$A$2:$B$188,2,FALSE),\"\")","v":""},null,223,"Missing",{"$f":"IFERROR(VLOOKUP(I24,Driver_01!$A$2:$B$150,2,FALSE),\"\")","v":""},{"$f":"IFERROR(VLOOKUP(I24,Driver_02!$A$2:$B$150,2,FALSE),\"\")","v":""},{"$f":"IFERROR(VLOOKUP(I24,Driver_03!$A$2:$B$150,2,FALSE),\"\")","v":""},{"$f":"IFERROR(VLOOKUP(I24,Driver_04!$A$2:$B$150,2,FALSE),\"\")","v":""},{"$f":"IFERROR(VLOOKUP(I24,Shop_01!$A$2:$B$150,2,FALSE),\"\")","v":""}]
[24,"Missing",{"$f":"IFERROR(VLOOKUP(A25,Driver_01!$A$2:$B$150,2,FALSE),\"\")","v":""},{"$f":"IFERROR(VLOOKUP(A25,Driver_02!$A$2:$B$150,2,FALSE),\"\")","v":""},{"$f":"IFERROR(VLOOKUP(A25,Driver_03!$A$2:$B$150,2,FALSE),\"\")","v":""},{"$f":"IFERROR(VLOOKUP(A25,Driver_04!$A$2:$B$150,2,FALSE),\"\")","v":""},{"$f":"IFERROR(VLOOKUP(A25,Shop_01!$A$2:$B$188,2,FALSE),\"\")","v":""},null,224,"Missing",{"$f":"IFERROR(VLOOKUP(I25,Driver_01!$A$2:$B$150,2,FALSE),\"\")","v":""},{"$f":"IFERROR(VLOOKUP(I25,Driver_02!$A$2:$B$150,2,FALSE),\"\")","v":""},{"$f":"IFERROR(VLOOKUP(I25,Driver_03!$A$2:$B$150,2,FALSE),\"\")","v":""},{"$f":"IFERROR(VLOOKUP(I25,Driver_04!$A$2:$B$150,2,FALSE),\"\")","v":""},{"$f":"IFERROR(VLOOKUP(I25,Shop_01!$A$2:$B$150,2,FALSE),\"\")","v":""}]
[25,"Missing",{"$f":"IFERROR(VLOOKUP(A26,Driver_01!$A$2:$B$150,2,FALSE),\"\")","v":""},{"$f":"IFERROR(VLOOKUP(A26,Driver_02!$A$2:$B$150,2,FALSE),\"\")","v":""},{"$f":"IFERROR(VLOOKUP(A26,Driver_03!$A$2:$B$150,2,FALSE),\"\")","v":""},{"$f":"IFERROR(VLOOKUP(A26,Driver_04!$A$2:$B$150,2,FALSE),\"\")","v":""},{"$f":"IFERROR(VLOOKUP(A26,Shop_01!$A$2:$B$188,2,FALSE),\"\")","v":""},null,225,"Missing",{"$f":"IFERROR(VLOOKUP(I26,Driver_01!$A$2:$B$150,2,FALSE),\"\")","v":""},{"$f":"IFERROR(VLOOKUP(I26,Driver_02!$A$2:$B$150,2,FALSE),\"\")","v":""},{"$f":"IFERROR(VLOOKUP(I26,Driver_03!$A$2:$B$150,2,FALSE),\"\")","v":""},{"$f":"IFERROR(VLOOKUP(I26,Driver_04!$A$2:$B$150,2,FALSE),\"\")","v":""},{"$f":"IFERROR(VLOOKUP(I26,Shop_01!$A$2:$B$150,2,FALSE),\"\")","v":""}]
[26,"Missing",{"$f":"IFERROR(VLOOKUP(A27,Driver_01!$A$2:$B$150,2,FALSE),\"\")","v":""},{"$f":"IFERROR(VLOOKUP(A27,Driver_02!$A$2:$B$150,2,FALSE),\"\")","v":""},{"$f":"IFERROR(VLOOKUP(A27,Driver_03!$A$2:$B$150,2,FALSE),\"\")","v":""},{"$f":"IFERROR(VLOOKUP(A27,Driver_04!$A$2:$B$150,2,FALSE),\"\")","v":""},{"$f":"IFERROR(VLOOKUP(A27,Shop_01!$A$2:$B$188,2,FALSE),\"\")","v":""},null,226,"Missing",{"$f":"IFERROR(VLOOKUP(I27,Driver_01!$A$2:$B$150,2,FALSE),\"\")","v":""},{"$f":"IFERROR(VLOOKUP(I27,Driver_02!$A$2:$B$150,2,FALSE),\"\")","v":""},{"$f":"IFERROR(VLOOKUP(I27,Driver_03!$A$2:$B$150,2,FALSE),\"\")","v":""},{"$f":"IFERROR(VLOOKUP(I27,Driver_04!$A$2:$B$150,2,FALSE),\"\")","v":""},{"$f":"IFERROR(VLOOKUP(I27,Shop_01!$A$2:$B$150,2,FALSE),\"\")","v":""}]
[27,"Missing",{"$f":"IFERROR(VLOOKUP(A28,Driver_01!$A$2:$B$150,2,FALSE),\"\")","v":""},{"$f":"IFERROR(VLOOKUP(A28,Driver_02!$A$2:$B$150,2,FALSE),\"\")","v":""},{"$f":"IFERROR(VLOOKUP(A28,Driver_03!$A$2:$B$150,2,FALSE),\"\")","v":""},{"$f":"IFERROR(VLOOKUP(A28,Driver_04!$A$2:$B$150,2,FALSE),\"\")","v":""},{"$f":"IFERROR(VLOOKUP(A28,Shop_01!$A$2:$B$188,2,FALSE),\"\")","v":""},null,227,"Missing",{"$f":"IFERROR(VLOOKUP(I28,Driver_01!$A$2:$B$150,2,FALSE),\"\")","v":""},{"$f":"IFERROR(VLOOKUP(I28,Driver_02!$A$2:$B$150,2,FALSE),\"\")","v":""},{"$f":"IFERROR(VLOOKUP(I28,Driver_03!$A$2:$B$150,2,FALSE),\"\")","v":""},{"$f":"IFERROR(VLOOKUP(I28,Driver_04!$A$2:$B$150,2,FALSE),\"\")","v":""},{"$f":"IFERROR(VLOOKUP(I28,Shop_01!$A$2:$B$150,2,FALSE),\"\")","v":""}]
[28,"Missing",{"$f":"IFERROR(VLOOKUP(A29,Driver_01!$A$2:$B$150,2,FALSE),\"\")","v":""},{"$f":"IFERROR(VLOOKUP(A29,Driver_02!$A$2:$B$150,2,FALSE),\"\")","v":""},{"$f":"IFERROR(VLOOKUP(A29,Driver_03!$A$2:$B$150,2,FALSE),\"\")","v":""},{"$f":"IFERROR(VLOOKUP(A29,Driver_04!$A$2:$B$150,2,FALSE),\"\")","v":""},{"$f":"IFERROR(VLOOKUP(A29,Shop_01!$A$2:$B$188,2,FALSE),\"\")","v":""},null,228,"Missing",{"$f":"IFERROR(VLOOKUP(I29,Driver_01!$A$2:$B$150,2,FALSE),\"\")","v":""},{"$f":"IFERROR(VLOOKUP(I29,Driver_02!$A$2:$B$150,2,FALSE),\"\")","v":""},{"$f":"IFERROR(VLOOKUP(I29,Driver_03!$A$2:$B$150,2,FALSE),\"\")","v":""},{"$f":"IFERROR(VLOOKUP(I29,Driver_04!$A$2:$B$150,2,FALSE),\"\")","v":""},{"$f":"IFERROR(VLOOKUP(I29,Shop_01!$A$2:$B$150,2,FALSE),\"\")","v":""}]
[29,"Missing",{"$f":"IFERROR(VLOOKUP(A30,Driver_01!$A$2:$B$150,2,FALSE),\"\")","v":""},{"$f":"IFERROR(VLOOKUP(A30,Driver_02!$A$2:$B$150,2,FALSE),\"\")","v":""},{"$f":"IFERROR(VLOOKUP(A30,Driver_03!$A$2:$B$150,2,FALSE),\"\")","v":""},{"$f":"IFERROR(VLOOKUP(A30,Driver_04!$A$2:$B$150,2,FALSE),\"\")","v":""},{"$f":"IFERROR(VLOOKUP(A30,Shop_01!$A$2:$B$188,2,FALSE),\"\")","v":""},null,229,"Missing",{"$f":"IFERROR(VLOOKUP(I30,Driver_01!$A$2:$B$150,2,FALSE),\"\")","v":""},{"$f":"IFERROR(VLOOKUP(I30,Driver_02!$A$2:$B$150,2,FALSE),\"\")","v":""},{"$f":"IFERROR(VLOOKUP(I30,Driver_03!$A$2:$B$150,2,FALSE),\"\")","v":""},{"$f":"IFERROR(VLOOKUP(I30,Driver_04!$A$2:$B$150,2,FALSE),\"\")","v":""},{"$f":"IFERROR(VLOOKUP(I30,Shop_01!$A$2:$B$150,2,FALSE),\"\")","v":""}]
[30,"Missing",{"$f":"IFERROR(VLOOKUP(A31,Driver_01!$A$2:$B$150,2,FALSE),\"\")","v":""},{"$f":"IFERROR(VLOOKUP(A31,Driver_02!$A$2:$B$150,2,FALSE),\"\")","v":""},{"$f":"IFERROR(VLOOKUP(A31,Driver_03!$A$2:$B$150,2,FALSE),\"\")","v":""},{"$f":"IFERROR(VLOOKUP(A31,Driver_04!$A$2:$B$150,2,FALSE),\"\")","v":""},{"$f":"IFERROR(VLOOKUP(A31,Shop_01!$A$2:$B$188,2,FALSE),\"\")","v":""},null,230,"Missing",{"$f":"IFERROR(VLOOKUP(I31,Driver_01!$A$2:$B$150,2,FALSE),\"\")","v":""},{"$f":"IFERROR(VLOOKUP(I31,Driver_02!$A$2:$B$150,2,FALSE),\"\")","v":""},{"$f":"IFERROR(VLOOKUP(I31,Driver_03!$A$2:$B$150,2,FALSE),\"\")","v":""},{"$f":"IFERROR(VLOOKUP(I31,Driver_04!$A$2:$B$150,2,FALSE),\"\")","v":""},{"$f":"IFERROR(VLOOKUP(I31,Shop_01!$A$2:$B$150,2,FALSE),\"\")","v":""}]
[31,"Missing",{"$f":"IFERROR(VLOOKUP(A32,Driver_01!$A$2:$B$150,2,FALSE),\"\")","v":""},{"$f":"IFERROR(VLOOKUP(A32,Driver_02!$A$2:$B$150,2,FALSE),\"\")","v":""},{"$f":"IFERROR(VLOOKUP(A32,Driver_03!$A$2:$B$150,2,FALSE),\"\")","v":""},{"$f":"IFERROR(VLOOKUP(A32,Driver_04!$A$2:$B$150,2,FALSE),\"\")","v":""},{"$f":"IFERROR(VLOOKUP(A32,Shop_01!$A$2:$B$188,2,FALSE),\"\")","v":""},null,231,"Missing",{"$f":"IFERROR(VLOOKUP(I32,Driver_01!$A$2:$B$150,2,FALSE),\"\")","v":""},{"$f":"IFERROR(VLOOKUP(I32,Driver_02!$A$2:$B$150,2,FALSE),\"\")","v":""},{"$f":"IFERROR(VLOOKUP(I32,Driver_03!$A$2:$B$150,2,FALSE),\"\")","v":""},{"$f":"IFERROR(VLOOKUP(I32,Driver_04!$A$2:$B$150,2,FALSE),\"\")","v":""},{"$f":"IFERROR(VLOOKUP(I32,Shop_01!$A$2:$B$150,2,FALSE),\"\")","v":""}]
[32,"Missing",{"$f":"IFERROR(VLOOKUP(A33,Driver_01!$A$2:$B$150,2,FALSE),\"\")","v":""},{"$f":"IFERROR(VLOOKUP(A33,Driver_02!$A$2:$B$150,2,FALSE),\"\")","v":""},{"$f":"IFERROR(VLOOKUP(A33,Driver_03!$A$2:$B$150,2,FALSE),\"\")","v":""},{"$f":"IFERROR(VLOOKUP(A33,Driver_04!$A$2:$B$150,2,FALSE),\"\")","v":""},{"$f":"IFERROR(VLOOKUP(A33,Shop_01!$A$2:$B$188,2,FALSE),\"\")","v":""},null,232,"Missing",{"$f":"IFERROR(VLOOKUP(I33,Driver_01!$A$2:$B$150,2,FALSE),\"\")","v":""},{"$f":"IFERROR(VLOOKUP(I33,Driver_02!$A$2:$B$150,2,FALSE),\"\")","v":""},{"$f":"IFERROR(VLOOKUP(I33,Driver_03!$A$2:$B$150,2,FALSE),\"\")","v":""},{"$f":"IFERROR(VLOOKUP(I33,Driver_04!$A$2:$B$150,2,FALSE),\"\")","v":""},{"$f":"IFERROR(VLOOKUP(I33,Shop_01!$A$2:$B$150,2,FALSE),\"\")","v":""}]
[33,"Missing",{"$f":"IFERROR(VLOOKUP(A34,Driver_01!$A$2:$B$150,2,FALSE),\"\")","v":""},{"$f":"IFERROR(VLOOKUP(A34,Driver_02!$A$2:$B$150,2,FALSE),\"\")","v":""},{"$f":"IFERROR(VLOOKUP(A34,Driver_03!$A$2:$B$150,2,FALSE),\"\")","v":""},{"$f":"IFERROR(VLOOKUP(A34,Driver_04!$A$2:$B$150,2,FALSE),\"\")","v":""},{"$f":"IFERROR(VLOOKUP(A34,Shop_01!$A$2:$B$188,2,FALSE),\"\")","v":""},null,233,"Missing",{"$f":"IFERROR(VLOOKUP(I34,Driver_01!$A$2:$B$150,2,FALSE),\"\")","v":""},{"$f":"IFERROR(VLOOKUP(I34,Driver_02!$A$2:$B$150,2,FALSE),\"\")","v":""},{"$f":"IFERROR(VLOOKUP(I34,Driver_03!$A$2:$B$150,2,FALSE),\"\")","v":""},{"$f":"IFERROR(VLOOKUP(I34,Driver_04!$A$2:$B$150,2,FALSE),\"\")","v":""},{"$f":"IFERROR(VLOOKUP(I34,Shop_01!$A$2:$B$150,2,FALSE),\"\")","v":""}]
[34,"Missing",{"$f":"IFERROR(VLOOKUP(A35,Driver_01!$A$2:$B$150,2,FALSE),\"\")","v":""},{"$f":"IFERROR(VLOOKUP(A35,Driver_02!$A$2:$B$150,2,FALSE),\"\")","v":""},{"$f":"IFERROR(VLOOKUP(A35,Driver_03!$A$2:$B$150,2,FALSE),\"\")","v":""},{"$f":"IFERROR(VLOOKUP(A35,Driver_04!$A$2:$B$150,2,FALSE),\"\")","v":""},{"$f":"IFERROR(VLOOKUP(A35,Shop_01!$A$2:$B$188,2,FALSE),\"\")","v":""},null,234,"Missing",{"$f":"IFERROR(VLOOKUP(I35,Driver_01!$A$2:$B$150,2,FALSE),\"\")","v":""},{"$f":"IFERROR(VLOOKUP(I35,Driver_02!$A$2:$B$150,2,FALSE),\"\")","v":""},{"$f":"IFERROR(VLOOKUP(I35,Driver_03!$A$2:$B$150,2,FALSE),\"\")","v":""},{"$f":"IFERROR(VLOOKUP(I35,Driver_04!$A$2:$B$150,2,FALSE),\"\")","v":""},{"$f":"IFERROR(VLOOKUP(I35,Shop_01!$A$2:$B$150,2,FALSE),\"\")","v":""}]
[35,"Missing",{"$f":"IFERROR(VLOOKUP(A36,Driver_01!$A$2:$B$150,2,FALSE),\"\")","v":""},{"$f":"IFERROR(VLOOKUP(A36,Driver_02!$A$2:$B$150,2,FALSE),\"\")","v":""},{"$f":"IFERROR(VLOOKUP(A36,Driver_03!$A$2:$B$150,2,FALSE),\"\")","v":""},{"$f":"IFERROR(VLOOKUP(A36,Driver_04!$A$2:$B$150,2,FALSE),\"\")","v":""},{"$f":"IFERROR(VLOOKUP(A36,Shop_01!$A$2:$B$188,2,FALSE),\"\")","v":""},null,235,"Missing",{"$f":"IFERROR(VLOOKUP(I36,Driver_01!$A$2:$B$150,2,FALSE),\"\")","v":""},{"$f":"IFERROR(VLOOKUP(I36,Driver_02!$A$2:$B$150,2,FALSE),\"\")","v":""},{"$f":"IFERROR(VLOOKUP(I36,Driver_03!$A$2:$B$150,2,FALSE),\"\")","v":""},{"$f":"IFERROR(VLOOKUP(I36,Driver_04!$A$2:$B$150,2,FALSE),\"\")","v":""},{"$f":"IFERROR(VLOOKUP(I36,Shop_01!$A$2:$B$150,2,FALSE),\"\")","v":""}]
[36,"Missing",{"$f":"IFERROR(VLOOKUP(A37,Driver_01!$A$2:$B$150,2,FALSE),\"\")","v":""},{"$f":"IFERROR(VLOOKUP(A37,Driver_02!$A$2:$B$150,2,FALSE),\"\")","v":""},{"$f":"IFERROR(VLOOKUP(A37,Driver_03!$A$2:$B$150,2,FALSE),\"\")","v":""},{"$f":"IFERROR(VLOOKUP(A37,Driver_04!$A$2:$B$150,2,FALSE),\"\")","v":""},{"$f":"IFERROR(VLOOKUP(A37,Shop_01!$A$2:$B$188,2,FALSE),\"\")","v":""},null,236,"Missing",{"$f":"IFERROR(VLOOKUP(I37,Driver_01!$A$2:$B$150,2,FALSE),\"\")","v":""},{"$f":"IFERROR(VLOOKUP(I37,Driver_02!$A$2:$B$150,2,FALSE),\"\")","v":""},{"$f":"IFERROR(VLOOKUP(I37,Driver_03!$A$2:$B$150,2,FALSE),\"\")","v":""},{"$f":"IFERROR(VLOOKUP(I37,Driver_04!$A$2:$B$150,2,FALSE),\"\")","v":""},{"$f":"IFERROR(VLOOKUP(I37,Shop_01!$A$2:$B$150,2,FALSE),\"\")","v":""}]
[37,"Missing",{"$f":"IFERROR(VLOOKUP(A38,Driver_01!$A$2:$B$150,2,FALSE),\"\")","v":""},{"$f":"IFERROR(VLOOKUP(A38,Driver_02!$A$2:$B$150,2,FALSE),\"\")","v":""},{"$f":"IFERROR(VLOOKUP(A38,Driver_03!$A$2:$B$150,2,FALSE),\"\")","v":""},{"$f":"IFERROR(VLOOKUP(A38,Driver_04!$A$2:$B$150,2,FALSE),\"\")","v":""},{"$f":"IFERROR(VLOOKUP(A38,Shop_01!$A$2:$B$188,2,FALSE),\"\")","v":""},null,237,"Missing",{"$f":"IFERROR(VLOOKUP(I38,Driver_01!$A$2:$B$150,2,FALSE),\"\")","v":""},{"$f":"IFERROR(VLOOKUP(I38,Driver_02!$A$2:$B$150,2,FALSE),\"\")","v":""},{"$f":"IFERROR(VLOOKUP(I38,Driver_03!$A$2:$B$150,2,FALSE),\"\")","v":""},{"$f":"IFERROR(VLOOKUP(I38,Driver_04!$A$2:$B$150,2,FALSE),\"\")","v":""},{"$f":"IFERROR(VLOOKUP(I38,Shop_01!$A$2:$B$150,2,FALSE),\"\")","v":""}]
[38,"Missing",{"$f":"IFERROR(VLOOKUP(A39,Driver_01!$A$2:$B$150,2,FALSE),\"\")","v":""},{"$f":"IFERROR(VLOOKUP(A39,Driver_02!$A$2:$B$150,2,FALSE),\"\")","v":""},{"$f":"IFERROR(VLOOKUP(A39,Driver_03!$A$2:$B$150,2,FALSE),\"\")","v":""},{"$f":"IFERROR(VLOOKUP(A39,Driver_04!$A$2:$B$150,2,FALSE),\"\")","v":""},{"$f":"IFERROR(VLOOKUP(A39,Shop_01!$A$2:$B$188,2,FALSE),\"\")","v":""},null,238,"Missing",{"$f":"IFERROR(VLOOKUP(I39,Driver_01!$A$2:$B$150,2,FALSE),\"\")","v":""},{"$f":"IFERROR(VLOOKUP(I39,Driver_02!$A$2:$B$150,2,FALSE),\"\")","v":""},{"$f":"IFERROR(VLOOKUP(I39,Driver_03!$A$2:$B$150,2,FALSE),\"\")","v":""},{"$f":"IFERROR(VLOOKUP(I39,Driver_04!$A$2:$B$150,2,FALSE),\"\")","v":""},{"$f":"IFERROR(VLOOKUP(I39,Shop_01!$A$2:$B$150,2,FALSE),\"\")","v":""}]
[39,"Missing",{"$f":"IFERROR(VLOOKUP(A40,Driver_01!$A$2:$B$150,2,FALSE),\"\")","v":""},{"$f":"IFERROR(VLOOKUP(A40,Driver_02!$A$2:$B$150,2,FALSE),\"\")","v":""},{"$f":"IFERROR(VLOOKUP(A40,Driver_03!$A$2:$B$150,2,FALSE),\"\")","v":""},{"$f":"IFERROR(VLOOKUP(A40,Driver_04!$A$2:$B$150,2,FALSE),\"\")","v":""},{"$f":"IFERROR(VLOOKUP(A40,Shop_01!$A$2:$B$188,2,FALSE),\"\")","v":""},null,239,"Missing",{"$f":"IFERROR(VLOOKUP(I40,Driver_01!$A$2:$B$150,2,FALSE),\"\")","v":""},{"$f":"IFERROR(VLOOKUP(I40,Driver_02!$A$2:$B$150,2,FALSE),\"\")","v":""},{"$f":"IFERROR(VLOOKUP(I40,Driver_03!$A$2:$B$150,2,FALSE),\"\")","v":""},{"$f":"IFERROR(VLOOKUP(I40,Driver_04!$A$2:$B$150,2,FALSE),\"\")","v":""},{"$f":"IFERROR(VLOOKUP(I40,Shop_01!$A$2:$B$150,2,FALSE),\"\")","v":""}]
[40,"Missing",{"$f":"IFERROR(VLOOKUP(A41,Driver_01!$A$2:$B$150,2,FALSE),\"\")","v":""},{"$f":"IFERROR(VLOOKUP(A41,Driver_02!$A$2:$B$150,2,FALSE),\"\")","v":""},{"$f":"IFERROR(VLOOKUP(A41,Driver_03!$A$2:$B$150,2,FALSE),\"\")","v":""},{"$f":"IFERROR(VLOOKUP(A41,Driver_04!$A$2:$B$150,2,FALSE),\"\")","v":""},{"$f":"IFERROR(VLOOKUP(A41,Shop_01!$A$2:$B$188,2,FALSE),\"\")","v":""},null,240,"Missing",{"$f":"IFERROR(VLOOKUP(I41,Driver_01!$A$2:$B$150,2,FALSE),\"\")","v":""},{"$f":"IFERROR(VLOOKUP(I41,Driver_02!$A$2:$B$150,2,FALSE),\"\")","v":""},{"$f":"IFERROR(VLOOKUP(I41,Driver_03!$A$2:$B$150,2,FALSE),\"\")","v":""},{"$f":"IFERROR(VLOOKUP(I41,Driver_04!$A$2:$B$150,2,FALSE),\"\")","v":""},{"$f":"IFERROR(VLOOKUP(I41,Shop_01!$A$2:$B$150,2,FALSE),\"\")","v":""}]
[41,"Missing",{"$f":"IFERROR(VLOOKUP(A42,Driver_01!$A$2:$B$150,2,FALSE),\"\")","v":""},{"$f":"IFERROR(VLOOKUP(A42,Driver_02!$A$2:$B$150,2,FALSE),\"\")","v":""},{"$f":"IFERROR(VLOOKUP(A42,Driver_03!$A$2:$B$150,2,FALSE),\"\")","v":""},{"$f":"IFERROR(VLOOKUP(A42,Driver_04!$A$2:$B$150,2,FALSE),\"\")","v":""},{"$f":"IFERROR(VLOOKUP(A42,Shop_01!$A$2:$B$188,2,FALSE),\"\")","v":""},null,241,"Missing",{"$f":"IFERROR(VLOOKUP(I42,Driver_01!$A$2:$B$150,2,FALSE),\"\")","v":""},{"$f":"IFERROR(VLOOKUP(I42,Driver_02!$A$2:$B$150,2,FALSE),\"\")","v":""},{"$f":"IFERROR(VLOOKUP(I42,Driver_03!$A$2:$B$150,2,FALSE),\"\")","v":""},{"$f":"IFERROR(VLOOKUP(I42,Driver_04!$A$2:$B$150,2,FALSE),\"\")","v":""},{"$f":"IFERROR(VLOOKUP(I42,Shop_01!$A$2:$B$150,2,FALSE),\"\")","v":""}]
[42,"Missing",{"$f":"IFERROR(VLOOKUP(A43,Driver_01!$A$2:$B$150,2,FALSE),\"\")","v":""},{"$f":"IFERROR(VLOOKUP(A43,Driver_02!$A$2:$B$150,2,FALSE),\"\")","v":""},{"$f":"IFERROR(VLOOKUP(A43,Driver_03!$A$2:$B$150,2,FALSE),\"\")","v":""},{"$f":"IFERROR(VLOOKUP(A43,Driver_04!$A$2:$B$150,2,FALSE),\"\")","v":""},{"$f":"IFERROR(VLOOKUP(A43,Shop_01!$A$2:$B$188,2,FALSE),\"\")","v":""},null,242,"Missing",{"$f":"IFERROR(VLOOKUP(I43,Driver_01!$A$2:$B$150,2,FALSE),\"\")","v":""},{"$f":"IFERROR(VLOOKUP(I43,Driver_02!$A$2:$B$150,2,FALSE),\"\")","v":""},{"$f":"IFERROR(VLOOKUP(I43,Driver_03!$A$2:$B$150,2,FALSE),\"\")","v":""},{"$f":"IFERROR(VLOOKUP(I43,Driver_04!$A$2:$B$150,2,FALSE),\"\")","v":""},{"$f":"IFERROR(VLOOKUP(I43,Shop_01!$A$2:$B$150,2,FALSE),\"\")","v":""}]
[43,"Missing",{"$f":"IFERROR(VLOOKUP(A44,Driver_01!$A$2:$B$150,2,FALSE),\"\")","v":""},{"$f":"IFERROR(VLOOKUP(A44,Driver_02!$A$2:$B$150,2,FALSE),\"\")","v":""},{"$f":"IFERROR(VLOOKUP(A44,Driver_03!$A$2:$B$150,2,FALSE),\"\")","v":""},{"$f":"IFERROR(VLOOKUP(A44,Driver_04!$A$2:$B$150,2,FALSE),\"\")","v":""},{"$f":"IFERROR(VLOOKUP(A44,Shop_01!$A$2:$B$188,2,FALSE),\"\")","v":""},null,243,"Missing",{"$f":"IFERROR(VLOOKUP(I44,Driver_01!$A$2:$B$150,2,FALSE),\"\")","v":""},{"$f":"IFERROR(VLOOKUP(I44,Driver_02!$A$2:$B$150,2,FALSE),\"\")","v":""},{"$f":"IFERROR(VLOOKUP(I44,Driver_03!$A$2:$B$150,2,FALSE),\"\")","v":""},{"$f":"IFERROR(VLOOKUP(I44,Driver_04!$A$2:$B$150,2,FALSE),\"\")","v":""},{"$f":"IFERROR(VLOOKUP(I44,Shop_01!$A$2:$B$150,2,FALSE),\"\")","v":""}]
[44,"Missing",{"$f":"IFERROR(VLOOKUP(A45,Driver_01!$A$2:$B$150,2,FALSE),\"\")","v":""},{"$f":"IFERROR(VLOOKUP(A45,Driver_02!$A$2:$B$150,2,FALSE),\"\")","v":""},{"$f":"IFERROR(VLOOKUP(A45,Driver_03!$A$2:$B$150,2,FALSE),\"\")","v":""},{"$f":"IFERROR(VLOOKUP(A45,Driver_04!$A$2:$B$150,2,FALSE),\"\")","v":""},{"$f":"IFERROR(VLOOKUP(A45,Shop_01!$A$2:$B$188,2,FALSE),\"\")","v":""},null,244,"Missing",{"$f":"IFERROR(VLOOKUP(I45,Driver_01!$A$2:$B$150,2,FALSE),\"\")","v":""},{"$f":"IFERROR(VLOOKUP(I45,Driver_02!$A$2:$B$150,2,FALSE),\"\")","v":""},{"$f":"IFERROR(VLOOKUP(I45,Driver_03!$A$2:$B$150,2,FALSE),\"\")","v":""},{"$f":"IFERROR(VLOOKUP(I45,Driver_04!$A$2:$B$150,2,FALSE),\"\")","v":""},{"$f":"IFERROR(VLOOKUP(I45,Shop_01!$A$2:$B$150,2,FALSE),\"\")","v":""}]
[45,"Missing",{"$f":"IFERROR(VLOOKUP(A46,Driver_01!$A$2:$B$150,2,FALSE),\"\")","v":""},{"$f":"IFERROR(VLOOKUP(A46,Driver_02!$A$2:$B$150,2,FALSE),\"\")","v":""},{"$f":"IFERROR(VLOOKUP(A46,Driver_03!$A$2:$B$150,2,FALSE),\"\")","v":""},{"$f":"IFERROR(VLOOKUP(A46,Driver_04!$A$2:$B$150,2,FALSE),\"\")","v":""},{"$f":"IFERROR(VLOOKUP(A46,Shop_01!$A$2:$B$188,2,FALSE),\"\")","v":""},null,245,"Missing",{"$f":"IFERROR(VLOOKUP(I46,Driver_01!$A$2:$B$150,2,FALSE),\"\")","v":""},{"$f":"IFERROR(VLOOKUP(I46,Driver_02!$A$2:$B$150,2,FALSE),\"\")","v":""},{"$f":"IFERROR(VLOOKUP(I46,Driver_03!$A$2:$B$150,2,FALSE),\"\")","v":""},{"$f":"IFERROR(VLOOKUP(I46,Driver_04!$A$2:$B$150,2,FALSE),\"\")","v":""},{"$f":"IFERROR(VLOOKUP(I46,Shop_01!$A$2:$B$150,2,FALSE),\"\")","v":""}]
[46,"Missing",{"$f":"IFERROR(VLOOKUP(A47,Driver_01!$A$2:$B$150,2,FALSE),\"\")","v":""},{"$f":"IFERROR(VLOOKUP(A47,Driver_02!$A$2:$B$150,2,FALSE),\"\")","v":""},{"$f":"IFERROR(VLOOKUP(A47,Driver_03!$A$2:$B$150,2,FALSE),\"\")","v":""},{"$f":"IFERROR(VLOOKUP(A47,Driver_04!$A$2:$B$150,2,FALSE),\"\")","v":""},{"$f":"IFERROR(VLOOKUP(A47,Shop_01!$A$2:$B$188,2,FALSE),\"\")","v":""},null,246,"Missing",{"$f":"IFERROR(VLOOKUP(I47,Driver_01!$A$2:$B$150,2,FALSE),\"\")","v":""},{"$f":"IFERROR(VLOOKUP(I47,Driver_02!$A$2:$B$150,2,FALSE),\"\")","v":""},{"$f":"IFERROR(VLOOKUP(I47,Driver_03!$A$2:$B$150,2,FALSE),\"\")","v":""},{"$f":"IFERROR(VLOOKUP(I47,Driver_04!$A$2:$B$150,2,FALSE),\"\")","v":""},{"$f":"IFERROR(VLOOKUP(I47,Shop_01!$A$2:$B$150,2,FALSE),\"\")","v":""}]
[47,"Missing",{"$f":"IFERROR(VLOOKUP(A48,Driver_01!$A$2:$B$150,2,FALSE),\"\")","v":""},{"$f":"IFERROR(VLOOKUP(A48,Driver_02!$A$2:$B$150,2,FALSE),\"\")","v":""},{"$f":"IFERROR(VLOOKUP(A48,Driver_03!$A$2:$B$150,2,FALSE),\"\")","v":""},{"$f":"IFERROR(VLOOKUP(A48,Driver_04!$A$2:$B$150,2,FALSE),\"\")","v":""},{"$f":"IFERROR(VLOOKUP(A48,Shop_01!$A$2:$B$188,2,FALSE),\"\")","v":""},null,247,"Missing",{"$f":"IFERROR(VLOOKUP(I48,Driver_01!$A$2:$B$150,2,FALSE),\"\")","v":""},{"$f":"IFERROR(VLOOKUP(I48,Driver_02!$A$2:$B$150,2,FALSE),\"\")","v":""},{"$f":"IFERROR(VLOOKUP(I48,Driver_03!$A$2:$B$150,2,FALSE),\"\")","v":""},{"$f":"IFERROR(VLOOKUP(I48,Driver_04!$A$2:$B$150,2,FALSE),\"\")","v":""},{"$f":"IFERROR(VLOOKUP(I48,Shop_01!$A$2:$B$150,2,FALSE),\"\")","v":""}]
[48,"Missing",{"$f":"IFERROR(VLOOKUP(A49,Driver_01!$A$2:$B$150,2,FALSE),\"\")","v":""},{"$f":"IFERROR(VLOOKUP(A49,Driver_02!$A$2:$B$150,2,FALSE),\"\")","v":""},{"$f":"IFERROR(VLOOKUP(A49,Driver_03!$A$2:$B$150,2,FALSE),\"\")","v":""},{"$f":"IFERROR(VLOOKUP(A49,Driver_04!$A$2:$B$150,2,FALSE),\"\")","v":""},{"$f":"IFERROR(VLOOKUP(A49,Shop_01!$A$2:$B$188,2,FALSE),\"\")","v":""},null,248,"Missing",{"$f":"IFERROR(VLOOKUP(I49,Driver_01!$A$2:$B$150,2,FALSE),\"\")","v":""},{"$f":"IFERROR(VLOOKUP(I49,Driver_02!$A$2:$B$150,2,FALSE),\"\")","v":""},{"$f":"IFERROR(VLOOKUP(I49,Driver_03!$A$2:$B$150,2,FALSE),\"\")","v":""},{"$f":"IFERROR(VLOOKUP(I49,Driver_04!$A$2:$B$150,2,FALSE),\"\")","v":""},{"$f":"IFERROR(VLOOKUP(I49,Shop_01!$A$2:$B$150,2,FALSE),\"\")","v":""}]
[49,"Missing",{"$f":"IFERROR(VLOOKUP(A50,Driver_01!$A$2:$B$150,2,FALSE),\"\")","v":""},{"$f":"IFERROR(VLOOKUP(A50,Driver_02!$A$2:$B$150,2,FALSE),\"\")","v":""},{"$f":"IFERROR(VLOOKUP(A50,Driver_03!$A$2:$B$150,2,FALSE),\"\")","v":""},{"$f":"IFERROR(VLOOKUP(A50,Driver_04!$A$2:$B$150,2,FALSE),\"\")","v":""},{"$f":"IFERROR(VLOOKUP(A50,Shop_01!$A$2:$B$188,2,FALSE),\"\")","v":""},null,249,"Missing",{"$f":"IFERROR(VLOOKUP(I50,Driver_01!$A$2:$B$150,2,FALSE),\"\")","v":""},{"$f":"IFERROR(VLOOKUP(I50,Driver_02!$A$2:$B$150,2,FALSE),\"\")","v":""},{"$f":"IFERROR(VLOOKUP(I50,Driver_03!$A$2:$B$150,2,FALSE),\"\")","v":""},{"$f":"IFERROR(VLOOKUP(I50,Driver_04!$A$2:$B$150,2,FALSE),\"\")","v":""},{"$f":"IFERROR(VLOOKUP(I50,Shop_01!$A$2:$B$150,2,FALSE),\"\")","v":""}]
[50,"Missing",{"$f":"IFERROR(VLOOKUP(A51,Driver_01!$A$2:$B$150,2,FALSE),\"\")","v":""},{"$f":"IFERROR(VLOOKUP(A51,Driver_02!$A$2:$B$150,2,FALSE),\"\")","v":""},{"$f":"IFERROR(VLOOKUP(A51,Driver_03!$A$2:$B$150,2,FALSE),\"\")","v":""},{"$f":"IFERROR(VLOOKUP(A51,Driver_04!$A$2:$B$150,2,FALSE),\"\")","v":""},{"$f":"IFERROR(VLOOKUP(A51,Shop_01!$A$2:$B$188,2,FALSE),\"\")","v":""},null,250,"Missing",{"$f":"IFERROR(VLOOKUP(I51,Driver_01!$A$2:$B$150,2,FALSE),\"\")","v":""},{"$f":"IFERROR(VLOOKUP(I51,Driver_02!$A$2:$B$150,2,FALSE),\"\")","v":""},{"$f":"IFERROR(VLOOKUP(I51,Driver_03!$A$2:$B$150,2,FALSE),\"\")","v":""},{"$f":"IFERROR(VLOOKUP(I51,Driver_04!$A$2:$B$150,2,FALSE),\"\")","v":""},{"$f":"IFERROR(VLOOKUP(I51,Shop_01!$A$2:$B$150,2,FALSE),\"\")","v":""}]
[51,"Missing",{"$f":"IFERROR(VLOOKUP(A52,Driver_01!$A$2:$B$150,2,FALSE),\"\")","v":""},{"$f":"IFERROR(VLOOKUP(A52,Driver_02!$A$2:$B$150,2,FALSE),\"\")","v":""},{"$f":"IFERROR(VLOOKUP(A52,Driver_03!$A$2:$B$150,2,FALSE),\"\")","v":""},{"$f":"IFERROR(VLOOKUP(A52,Driver_04!$A$2:$B$150,2,FALSE),\"\")","v":""},{"$f":"IFERROR(VLOOKUP(A52,Shop_01!$A$2:$B$188,2,FALSE),\"\")","v":""},null,251,"Missing",{"$f":"IFERROR(VLOOKUP(I52,Driver_01!$A$2:$B$150,2,FALSE),\"\")","v":""},{"$f":"IFERROR(VLOOKUP(I52,Driver_02!$A$2:$B$150,2,FALSE),\"\")","v":""},{"$f":"IFERROR(VLOOKUP(I52,Driver_03!$A$2:$B$150,2,FALSE),\"\")","v":""},{"$f":"IFERROR(VLOOKUP(I52,Driver_04!$A$2:$B$150,2,FALSE),\"\")","v":""},{"$f":"IFERROR(VLOOKUP(I52,Shop_01!$A$2:$B$150,2,FALSE),\"\")","v":""}]
[52,"Missing",{"$f":"IFERROR(VLOOKUP(A53,Driver_01!$A$2:$B$150,2,FALSE),\"\")","v":""},{"$f":"IFERROR(VLOOKUP(A53,Driver_02!$A$2:$B$150,2,FALSE),\"\")","v":""},{"$f":"IFERROR(VLOOKUP(A53,Driver_03!$A$2:$B$150,2,FALSE),\"\")","v":""},{"$f":"IFERROR(VLOOKUP(A53,Driver_04!$A$2:$B$150,2,FALSE),\"\")","v":""},{"$f":"IFERROR(VLOOKUP(A53,Shop_01!$A$2:$B$188,2,FALSE),\"\")","v":""},null,252,"Missing",{"$f":"IFERROR(VLOOKUP(I53,Driver_01!$A$2:$B$150,2,FALSE),\"\")","v":""},{"$f":"IFERROR(VLOOKUP(I53,Driver_02!$A$2:$B$150,2,FALSE),\"\")","v":""},{"$f":"IFERROR(VLOOKUP(I53,Driver_03!$A$2:$B$150,2,FALSE),\"\")","v":""},{"$f":"IFERROR(VLOOKUP(I53,Driver_04!$A$2:$B$150,2,FALSE),\"\")","v":""},{"$f":"IFERROR(VLOOKUP(I53,Shop_01!$A$2:$B$150,2,FALSE),\"\")","v":""}]
[53,"Missing",{"$f":"IFERROR(VLOOKUP(A54,Driver_01!$A$2:$B$150,2,FALSE),\"\")","v":""},{"$f":"IFERROR(VLOOKUP(A54,Driver_02!$A$2:$B$150,2,FALSE),\"\")","v":""},{"$f":"IFERROR(VLOOKUP(A54,Driver_03!$A$2:$B$150,2,FALSE),\"\")","v":""},{"$f":"IFERROR(VLOOKUP(A54,Driver_04!$A$2:$B$150,2,FALSE),\"\")","v":""},{"$f":"IFERROR(VLOOKUP(A54,Shop_01!$A$2:$B$188,2,FALSE),\"\")","v":""},null,253,"Missing",{"$f":"IFERROR(VLOOKUP(I54,Driver_01!$A$2:$B$150,2,FALSE),\"\")","v":""},{"$f":"IFERROR(VLOOKUP(I54,Driver_02!$A$2:$B$150,2,FALSE),\"\")","v":""},{"$f":"IFERROR(VLOOKUP(I54,Driver_03!$A$2:$B$150,2,FALSE),\"\")","v":""},{"$f":"IFERROR(VLOOKUP(I54,Driver_04!$A$2:$B$150,2,FALSE),\"\")","v":""},{"$f":"IFERROR(VLOOKUP(I54,Shop_01!$A$2:$B$150,2,FALSE),\"\")","v":""}]
[54,"Missing",{"$f":"IFERROR(VLOOKUP(A55,Driver_01!$A$2:$B$150,2,FALSE),\"\")","v":""},{"$f":"IFERROR(VLOOKUP(A55,Driver_02!$A$2:$B$150,2,FALSE),\"\")","v":""},{"$f":"IFERROR(VLOOKUP(A55,Driver_03!$A$2:$B$150,2,FALSE),\"\")","v":""},{"$f":"IFERROR(VLOOKUP(A55,Driver_04!$A$2:$B$150,2,FALSE),\"\")","v":""},{"$f":"IFERROR(VLOOKUP(A55,Shop_01!$A$2:$B$188,2,FALSE),\"\")","v":""},null,254,"Missing",{"$f":"IFERROR(VLOOKUP(I55,Driver_01!$A$2:$B$150,2,FALSE),\"\")","v":""},{"$f":"IFERROR(VLOOKUP(I55,Driver_02!$A$2:$B$150,2,FALSE),\"\")","v":""},{"$f":"IFERROR(VLOOKUP(I55,Driver_03!$A$2:$B$150,2,FALSE),\"\")","v":""},{"$f":"IFERROR(VLOOKUP(I55,Driver_04!$A$2:$B$150,2,FALSE),\"\")","v":""},{"$f":"IFERROR(VLOOKUP(I55,Shop_01!$A$2:$B$150,2,FALSE),\"\")","v":""}]
[55,"Missing",{"$f":"IFERROR(VLOOKUP(A56,Driver_01!$A$2:$B$150,2,FALSE),\"\")","v":""},{"$f":"IFERROR(VLOOKUP(A56,Driver_02!$A$2:$B$150,2,FALSE),\"\")","v":""},{"$f":"IFERROR(VLOOKUP(A56,Driver_03!$A$2:$B$150,2,FALSE),\"\")","v":""},{"$f":"IFERROR(VLOOKUP(A56,Driver_04!$A$2:$B$150,2,FALSE),\"\")","v":""},{"$f":"IFERROR(VLOOKUP(A56,Shop_01!$A$2:$B$188,2,FALSE),\"\")","v":""},null,255,"Missing",{"$f":"IFERROR(VLOOKUP(I56,Driver_01!$A$2:$B$150,2,FALSE),\"\")","v":""},{"$f":"IFERROR(VLOOKUP(I56,Driver_02!$A$2:$B$150,2,FALSE),\"\")","v":""},{"$f":"IFERROR(VLOOKUP(I56,Driver_03!$A$2:$B$150,2,FALSE),\"\")","v":""},{"$f":"IFERROR(VLOOKUP(I56,Driver_04!$A$2:$B$150,2,FALSE),\"\")","v":""},{"$f":"IFERROR(VLOOKUP(I56,Shop_01!$A$2:$B$150,2,FALSE),\"\")","v":""}]
[56,"Missing",{"$f":"IFERROR(VLOOKUP(A57,Driver_01!$A$2:$B$150,2,FALSE),\"\")","v":""},{"$f":"IFERROR(VLOOKUP(A57,Driver_02!$A$2:$B$150,2,FALSE),\"\")","v":""},{"$f":"IFERROR(VLOOKUP(A57,Driver_03!$A$2:$B$150,2,FALSE),\"\")","v":""},{"$f":"IFERROR(VLOOKUP(A57,Driver_04!$A$2:$B$150,2,FALSE),\"\")","v":""},{"$f":"IFERROR(VLOOKUP(A57,Shop_01!$A$2:$B$188,2,FALSE),\"\")","v":""},null,256,"Missing",{"$f":"IFERROR(VLOOKUP(I57,Driver_01!$A$2:$B$150,2,FALSE),\"\")","v":""},{"$f":"IFERROR(VLOOKUP(I57,Driver_02!$A$2:$B$150,2,FALSE),\"\")","v":""},{"$f":"IFERROR(VLOOKUP(I57,Driver_03!$A$2:$B$150,2,FALSE),\"\")","v":""},{"$f":"IFERROR(VLOOKUP(I57,Driver_04!$A$2:$B$150,2,FALSE),\"\")","v":""},{"$f":"IFERROR(VLOOKUP(I57,Shop_01!$A$2:$B$150,2,FALSE),\"\")","v":""}]
[57,"Missing",{"$f":"IFERROR(VLOOKUP(A58,Driver_01!$A$2:$B$150,2,FALSE),\"\")","v":""},{"$f":"IFERROR(VLOOKUP(A58,Driver_02!$A$2:$B$150,2,FALSE),\"\")","v":""},{"$f":"IFERROR(VLOOKUP(A58,Driver_03!$A$2:$B$150,2,FALSE),\"\")","v":""},{"$f":"IFERROR(VLOOKUP(A58,Driver_04!$A$2:$B$150,2,FALSE),\"\")","v":""},{"$f":"IFERROR(VLOOKUP(A58,Shop_01!$A$2:$B$188,2,FALSE),\"\")","v":""},null,257,"Missing",{"$f":"IFERROR(VLOOKUP(I58,Driver_01!$A$2:$B$150,2,FALSE),\"\")","v":""},{"$f":"IFERROR(VLOOKUP(I58,Driver_02!$A$2:$B$150,2,FALSE),\"\")","v":""},{"$f":"IFERROR(VLOOKUP(I58,Driver_03!$A$2:$B$150,2,FALSE),\"\")","v":""},{"$f":"IFERROR(VLOOKUP(I58,Driver_04!$A$2:$B$150,2,FALSE),\"\")","v":""},{"$f":"IFERROR(VLOOKUP(I58,Shop_01!$A$2:$B$150,2,FALSE),\"\")","v":""}]
[58,"Missing",{"$f":"IFERROR(VLOOKUP(A59,Driver_01!$A$2:$B$150,2,FALSE),\"\")","v":""},{"$f":"IFERROR(VLOOKUP(A59,Driver_02!$A$2:$B$150,2,FALSE),\"\")","v":""},{"$f":"IFERROR(VLOOKUP(A59,Driver_03!$A$2:$B$150,2,FALSE),\"\")","v":""},{"$f":"IFERROR(VLOOKUP(A59,Driver_04!$A$2:$B$150,2,FALSE),\"\")","v":""},{"$f":"IFERROR(VLOOKUP(A59,Shop_01!$A$2:$B$188,2,FALSE),\"\")","v":""},null,258,"Missing",{"$f":"IFERROR(VLOOKUP(I59,Driver_01!$A$2:$B$150,2,FALSE),\"\")","v":""},{"$f":"IFERROR(VLOOKUP(I59,Driver_02!$A$2:$B$150,2,FALSE),\"\")","v":""},{"$f":"IFERROR(VLOOKUP(I59,Driver_03!$A$2:$B$150,2,FALSE),\"\")","v":""},{"$f":"IFERROR(VLOOKUP(I59,Driver_04!$A$2:$B$150,2,FALSE),\"\")","v":""},{"$f":"IFERROR(VLOOKUP(I59,Shop_01!$A$2:$B$150,2,FALSE),\"\")","v":""}]
[59,"Missing",{"$f":"IFERROR(VLOOKUP(A60,Driver_01!$A$2:$B$150,2,FALSE),\"\")","v":""},{"$f":"IFERROR(VLOOKUP(A60,Driver_02!$A$2:$B$150,2,FALSE),\"\")","v":""},{"$f":"IFERROR(VLOOKUP(A60,Driver_03!$A$2:$B$150,2,FALSE),\"\")","v":""},{"$f":"IFERROR(VLOOKUP(A60,Driver_04!$A$2:$B$150,2,FALSE),\"\")","v":""},{"$f":"IFERROR(VLOOKUP(A60,Shop_01!$A$2:$B$188,2,FALSE),\"\")","v":""},null,259,"Missing",{"$f":"IFERROR(VLOOKUP(I60,Driver_01!$A$2:$B$150,2,FALSE),\"\")","v":""},{"$f":"IFERROR(VLOOKUP(I60,Driver_02!$A$2:$B$150,2,FALSE),\"\")","v":""},{"$f":"IFERROR(VLOOKUP(I60,Driver_03!$A$2:$B$150,2,FALSE),\"\")","v":""},{"$f":"IFERROR(VLOOKUP(I60,Driver_04!$A$2:$B$150,2,FALSE),\"\")","v":""},{"$f":"IFERROR(VLOOKUP(I60,Shop_01!$A$2:$B$150,2,FALSE),\"\")","v":""}]
[60,"Missing",{"$f":"IFERROR(VLOOKUP(A61,Driver_01!$A$2:$B$150,2,FALSE),\"\")","v":""},{"$f":"IFERROR(VLOOKUP(A61,Driver_02!$A$2:$B$150,2,FALSE),\"\")","v":""},{"$f":"IFERROR(VLOOKUP(A61,Driver_03!$A$2:$B$150,2,FALSE),\"\")","v":""},{"$f":"IFERROR(VLOOKUP(A61,Driver_04!$A$2:$B$150,2,FALSE),\"\")","v":""},{"$f":"IFERROR(VLOOKUP(A61,Shop_01!$A$2:$B$188,2,FALSE),\"\")","v":""},null,260,"Missing",{"$f":"IFERROR(VLOOKUP(I61,Driver_01!$A$2:$B$150,2,FALSE),\"\")","v":""},{"$f":"IFERROR(VLOOKUP(I61,Driver_02!$A$2:$B$150,2,FALSE),\"\")","v":""},{"$f":"IFERROR(VLOOKUP(I61,Driver_03!$A$2:$B$150,2,FALSE),\"\")","v":""},{"$f":"IFERROR(VLOOKUP(I61,Driver_04!$A$2:$B$150,2,FALSE),\"\")","v":""},{"$f":"IFERROR(VLOOKUP(I61,Shop_01!$A$2:$B$150,2,FALSE),\"\")","v":""}]
[61,"Missing",{"$f":"IFERROR(VLOOKUP(A62,Driver_01!$A$2:$B$150,2,FALSE),\"\")","v":""},{"$f":"IFERROR(VLOOKUP(A62,Driver_02!$A$2:$B$150,2,FALSE),\"\")","v":""},{"$f":"IFERROR(VLOOKUP(A62,Driver_03!$A$2:$B$150,2,FALSE),\"\")","v":""},{"$f":"IFERROR(VLOOKUP(A62,Driver_04!$A$2:$B$150,2,FALSE),\"\")","v":""},{"$f":"IFERROR(VLOOKUP(A62,Shop_01!$A$2:$B$188,2,FALSE),\"\")","v":""},null,261,"Missing",{"$f":"IFERROR(VLOOKUP(I62,Driver_01!$A$2:$B$150,2,FALSE),\"\")","v":""},{"$f":"IFERROR(VLOOKUP(I62,Driver_02!$A$2:$B$150,2,FALSE),\"\")","v":""},{"$f":"IFERROR(VLOOKUP(I62,Driver_03!$A$2:$B$150,2,FALSE),\"\")","v":""},{"$f":"IFERROR(VLOOKUP(I62,Driver_04!$A$2:$B$150,2,FALSE),\"\")","v":""},{"$f":"IFERROR(VLOOKUP(I62,Shop_01!$A$2:$B$150,2,FALSE),\"\")","v":""}]
[62,"Missing",{"$f":"IFERROR(VLOOKUP(A63,Driver_01!$A$2:$B$150,2,FALSE),\"\")","v":""},{"$f":"IFERROR(VLOOKUP(A63,Driver_02!$A$2:$B$150,2,FALSE),\"\")","v":""},{"$f":"IFERROR(VLOOKUP(A63,Driver_03!$A$2:$B$150,2,FALSE),\"\")","v":""},{"$f":"IFERROR(VLOOKUP(A63,Driver_04!$A$2:$B$150,2,FALSE),\"\")","v":""},{"$f":"IFERROR(VLOOKUP(A63,Shop_01!$A$2:$B$188,2,FALSE),\"\")","v":""},null,262,"Missing",{"$f":"IFERROR(VLOOKUP(I63,Driver_01!$A$2:$B$150,2,FALSE),\"\")","v":""},{"$f":"IFERROR(VLOOKUP(I63,Driver_02!$A$2:$B$150,2,FALSE),\"\")","v":""},{"$f":"IFERROR(VLOOKUP(I63,Driver_03!$A$2:$B$150,2,FALSE),\"\")","v":""},{"$f":"IFERROR(VLOOKUP(I63,Driver_04!$A$2:$B$150,2,FALSE),\"\")","v":""},{"$f":"IFERROR(VLOOKUP(I63,Shop_01!$A$2:$B$150,2,FALSE),\"\")","v":""}]
[63,"Missing",{"$f":"IFERROR(VLOOKUP(A64,Driver_01!$A$2:$B$150,2,FALSE),\"\")","v":""},{"$f":"IFERROR(VLOOKUP(A64,Driver_02!$A$2:$B$150,2,FALSE),\"\")","v":""},{"$f":"IFERROR(VLOOKUP(A64,Driver_03!$A$2:$B$150,2,FALSE),\"\")","v":""},{"$f":"IFERROR(VLOOKUP(A64,Driver_04!$A$2:$B$150,2,FALSE),\"\")","v":""},{"$f":"IFERROR(VLOOKUP(A64,Shop_01!$A$2:$B$188,2,FALSE),\"\")","v":""},null,263,"Missing",{"$f":"IFERROR(VLOOKUP(I64,Driver_01!$A$2:$B$150,2,FALSE),\"\")","v":""},{"$f":"IFERROR(VLOOKUP(I64,Driver_02!$A$2:$B$150,2,FALSE),\"\")","v":""},{"$f":"IFERROR(VLOOKUP(I64,Driver_03!$A$2:$B$150,2,FALSE),\"\")","v":""},{"$f":"IFERROR(VLOOKUP(I64,Driver_04!$A$2:$B$150,2,FALSE),\"\")","v":""},{"$f":"IFERROR(VLOOKUP(I64,Shop_01!$A$2:$B$150,2,FALSE),\"\")","v":""}]
[64,"Missing",{"$f":"IFERROR(VLOOKUP(A65,Driver_01!$A$2:$B$150,2,FALSE),\"\")","v":""},{"$f":"IFERROR(VLOOKUP(A65,Driver_02!$A$2:$B$150,2,FALSE),\"\")","v":""},{"$f":"IFERROR(VLOOKUP(A65,Driver_03!$A$2:$B$150,2,FALSE),\"\")","v":""},{"$f":"IFERROR(VLOOKUP(A65,Driver_04!$A$2:$B$150,2,FALSE),\"\")","v":""},{"$f":"IFERROR(VLOOKUP(A65,Shop_01!$A$2:$B$188,2,FALSE),\"\")","v":""},null,264,"Missing",{"$f":"IFERROR(VLOOKUP(I65,Driver_01!$A$2:$B$150,2,FALSE),\"\")","v":""},{"$f":"IFERROR(VLOOKUP(I65,Driver_02!$A$2:$B$150,2,FALSE),\"\")","v":""},{"$f":"IFERROR(VLOOKUP(I65,Driver_03!$A$2:$B$150,2,FALSE),\"\")","v":""},{"$f":"IFERROR(VLOOKUP(I65,Driver_04!$A$2:$B$150,2,FALSE),\"\")","v":""},{"$f":"IFERROR(VLOOKUP(I65,Shop_01!$A$2:$B$150,2,FALSE),\"\")","v":""}]
[65,"Missing",{"$f":"IFERROR(VLOOKUP(A66,Driver_01!$A$2:$B$150,2,FALSE),\"\")","v":""},{"$f":"IFERROR(VLOOKUP(A66,Driver_02!$A$2:$B$150,2,FALSE),\"\")","v":""},{"$f":"IFERROR(VLOOKUP(A66,Driver_03!$A$2:$B$150,2,FALSE),\"\")","v":""},{"$f":"IFERROR(VLOOKUP(A66,Driver_04!$A$2:$B$150,2,FALSE),\"\")","v":""},{"$f":"IFERROR(VLOOKUP(A66,Shop_01!$A$2:$B$188,2,FALSE),\"\")","v":""},null,265,{"$f":"IF(SUM(K66:O66)<0.5,\"Missing\",SUM(K66:O66))","v":"Missing"},{"$f":"IFERROR(VLOOKUP(I66,Driver_01!$A$2:$B$150,2,FALSE),\"\")","v":""},{"$f":"IFERROR(VLOOKUP(I66,Driver_02!$A$2:$B$150,2,FALSE),\"\")","v":""},{"$f":"IFERROR(VLOOKUP(I66,Driver_03!$A$2:$B$150,2,FALSE),\"\")","v":""},{"$f":"IFERROR(VLOOKUP(I66,Driver_04!$A$2:$B$150,2,FALSE),\"\")","v":""},{"$f":"IFERROR(VLOOKUP(I66,Shop_01!$A$2:$B$150,2,FALSE),\"\")","v":""}]
[66,"Missing",{"$f":"IFERROR(VLOOKUP(A67,Driver_01!$A$2:$B$150,2,FALSE),\"\")","v":""},{"$f":"IFERROR(VLOOKUP(A67,Driver_02!$A$2:$B$150,2,FALSE),\"\")","v":""},{"$f":"IFERROR(VLOOKUP(A67,Driver_03!$A$2:$B$150,2,FALSE),\"\")","v":""},{"$f":"IFERROR(VLOOKUP(A67,Driver_04!$A$2:$B$150,2,FALSE),\"\")","v":""},{"$f":"IFERROR(VLOOKUP(A67,Shop_01!$A$2:$B$188,2,FALSE),\"\")","v":""},null,266,"Missing",{"$f":"IFERROR(VLOOKUP(I67,Driver_01!$A$2:$B$150,2,FALSE),\"\")","v":""},{"$f":"IFERROR(VLOOKUP(I67,Driver_02!$A$2:$B$150,2,FALSE),\"\")","v":""},{"$f":"IFERROR(VLOOKUP(I67,Driver_03!$A$2:$B$150,2,FALSE),\"\")","v":""},{"$f":"IFERROR(VLOOKUP(I67,Driver_04!$A$2:$B$150,2,FALSE),\"\")","v":""},{"$f":"IFERROR(VLOOKUP(I67,Shop_01!$A$2:$B$150,2,FALSE),\"\")","v":""}]
[{"$f":"A67+1","v":67},"Missing",{"$f":"IFERROR(VLOOKUP(A68,Driver_01!$A$2:$B$150,2,FALSE),\"\")","v":""},{"$f":"IFERROR(VLOOKUP(A68,Driver_02!$A$2:$B$150,2,FALSE),\"\")","v":""},{"$f":"IFERROR(VLOOKUP(A68,Driver_03!$A$2:$B$150,2,FALSE),\"\")","v":""},{"$f":"IFERROR(VLOOKUP(A68,Driver_04!$A$2:$B$150,2,FALSE),\"\")","v":""},{"$f":"IFERROR(VLOOKUP(A68,Shop_01!$A$2:$B$188,2,FALSE),\"\")","v":""},null,{"$f":"I67+1","v":267},"Missing",{"$f":"IFERROR(VLOOKUP(I68,Driver_01!$A$2:$B$150,2,FALSE),\"\")","v":""},{"$f":"IFERROR(VLOOKUP(I68,Driver_02!$A$2:$B$150,2,FALSE),\"\")","v":""},{"$f":"IFERROR(VLOOKUP(I68,Driver_03!$A$2:$B$150,2,FALSE),\"\")","v":""},{"$f":"IFERROR(VLOOKUP(I68,Driver_04!$A$2:$B$150,2,FALSE),\"\")","v":""},{"$f":"IFERROR(VLOOKUP(I68,Shop_01!$A$2:$B$150,2,FALSE),\"\")","v":""}]
[68,"Missing",{"$f":"IFERROR(VLOOKUP(A69,Driver_01!$A$2:$B$150,2,FALSE),\"\")","v":""},{"$f":"IFERROR(VLOOKUP(A69,Driver_02!$A$2:$B$150,2,FALSE),\"\")","v":""},{"$f":"IFERROR(VLOOKUP(A69,Driver_03!$A$2:$B$150,2,FALSE),\"\")","v":""},{"$f":"IFERROR(VLOOKUP(A69,Driver_04!$A$2:$B$150,2,FALSE),\"\")","v":""},{"$f":"IFERROR(VLOOKUP(A69,Shop_01!$A$2:$B$188,2,FALSE),\"\")","v":""},null,268,"Missing",{"$f":"IFERROR(VLOOKUP(I69,Driver_01!$A$2:$B$150,2,FALSE),\"\")","v":""},{"$f":"IFERROR(VLOOKUP(I69,Driver_02!$A$2:$B$150,2,FALSE),\"\")","v":""},{"$f":"IFERROR(VLOOKUP(I69,Driver_03!$A$2:$B$150,2,FALSE),\"\")","v":""},{"$f":"IFERROR(VLOOKUP(I69,Driver_04!$A$2:$B$150,2,FALSE),\"\")","v":""},{"$f":"IFERROR(VLOOKUP(I69,Shop_01!$A$2:$B$150,2,FALSE),\"\")","v":""}]
[69,{"$f":"IF(SUM(C70:G70)<0.5,\"Missing\",SUM(C70:G70))","v":"Missing"},{"$f":"IFERROR(VLOOKUP(A70,Driver_01!$A$2:$B$150,2,FALSE),\"\")","v":""},{"$f":"IFERROR(VLOOKUP(A70,Driver_02!$A$2:$B$150,2,FALSE),\"\")","v":""},{"$f":"IFERROR(VLOOKUP(A70,Driver_03!$A$2:$B$150,2,FALSE),\"\")","v":""},{"$f":"IFERROR(VLOOKUP(A70,Driver_04!$A$2:$B$150,2,FALSE),\"\")","v":""},{"$f":"IFERROR(VLOOKUP(A70,Shop_01!$A$2:$B$188,2,FALSE),\"\")","v":""},null,269,"Missing",{"$f":"IFERROR(VLOOKUP(I70,Driver_01!$A$2:$B$150,2,FALSE),\"\")","v":""},{"$f":"IFERROR(VLOOKUP(I70,Driver_02!$A$2:$B$150,2,FALSE),\"\")","v":""},{"$f":"IFERROR(VLOOKUP(I70,Driver_03!$A$2:$B$150,2,FALSE),\"\")","v":""},{"$f":"IFERROR(VLOOKUP(I70,Driver_04!$A$2:$B$150,2,FALSE),\"\")","v":""},{"$f":"IFERROR(VLOOKUP(I70,Shop_01!$A$2:$B$150,2,FALSE),\"\")","v":""}]
[70,"Missing",{"$f":"IFERROR(VLOOKUP(A71,Driver_01!$A$2:$B$150,2,FALSE),\"\")","v":""},{"$f":"IFERROR(VLOOKUP(A71,Driver_02!$A$2:$B$150,2,FALSE),\"\")","v":""},{"$f":"IFERROR(VLOOKUP(A71,Driver_03!$A$2:$B$150,2,FALSE),\"\")","v":""},{"$f":"IFERROR(VLOOKUP(A71,Driver_04!$A$2:$B$150,2,FALSE),\"\")","v":""},{"$f":"IFERROR(VLOOKUP(A71,Shop_01!$A$2:$B$188,2,FALSE),\"\")","v":""},null,270,"Missing",{"$f":"IFERROR(VLOOKUP(I71,Driver_01!$A$2:$B$150,2,FALSE),\"\")","v":""},{"$f":"IFERROR(VLOOKUP(I71,Driver_02!$A$2:$B$150,2,FALSE),\"\")","v":""},{"$f":"IFERROR(VLOOKUP(I71,Driver_03!$A$2:$B$150,2,FALSE),\"\")","v":""},{"$f":"IFERROR(VLOOKUP(I71,Driver_04!$A$2:$B$150,2,FALSE),\"\")","v":""},{"$f":"IFERROR(VLOOKUP(I71,Shop_01!$A$2:$B$150,2,FALSE),\"\")","v":""}]
[71,"Missing",{"$f":"IFERROR(VLOOKUP(A72,Driver_01!$A$2:$B$150,2,FALSE),\"\")","v":""},{"$f":"IFERROR(VLOOKUP(A72,Driver_02!$A$2:$B$150,2,FALSE),\"\")","v":""},{"$f":"IFERROR(VLOOKUP(A72,Driver_03!$A$2:$B$150,2,FALSE),\"\")","v":""},{"$f":"IFERROR(VLOOKUP(A72,Driver_04!$A$2:$B$150,2,FALSE),\"\")","v":""},{"$f":"IFERROR(VLOOKUP(A72,Shop_01!$A$2:$B$188,2,FALSE),\"\")","v":""},null,271,"Missing",{"$f":"IFERROR(VLOOKUP(I72,Driver_01!$A$2:$B$150,2,FALSE),\"\")","v":""},{"$f":"IFERROR(VLOOKUP(I72,Driver_02!$A$2:$B$150,2,FALSE),\"\")","v":""},{"$f":"IFERROR(VLOOKUP(I72,Driver_03!$A$2:$B$150,2,FALSE),\"\")","v":""},{"$f":"IFERROR(VLOOKUP(I72,Driver_04!$A$2:$B$150,2,FALSE),\"\")","v":""},{"$f":"IFERROR(VLOOKUP(I72,Shop_01!$A$2:$B$150,2,FALSE),\"\")","v":""}]
[72,"Missing",{"$f":"IFERROR(VLOOKUP(A73,Driver_01!$A$2:$B$150,2,FALSE),\"\")","v":""},{"$f":"IFERROR(VLOOKUP(A73,Driver_02!$A$2:$B$150,2,FALSE),\"\")","v":""},{"$f":"IFERROR(VLOOKUP(A73,Driver_03!$A$2:$B$150,2,FALSE),\"\")","v":""},{"$f":"IFERROR(VLOOKUP(A73,Driver_04!$A$2:$B$150,2,FALSE),\"\")","v":""},{"$f":"IFERROR(VLOOKUP(A73,Shop_01!$A$2:$B$188,2,FALSE),\"\")","v":""},null,272,"Missing",{"$f":"IFERROR(VLOOKUP(I73,Driver_01!$A$2:$B$150,2,FALSE),\"\")","v":""},{"$f":"IFERROR(VLOOKUP(I73,Driver_02!$A$2:$B$150,2,FALSE),\"\")","v":""},{"$f":"IFERROR(VLOOKUP(I73,Driver_03!$A$2:$B$150,2,FALSE),\"\")","v":""},{"$f":"IFERROR(VLOOKUP(I73,Driver_04!$A$2:$B$150,2,FALSE),\"\")","v":""},{"$f":"IFERROR(VLOOKUP(I73,Shop_01!$A$2:$B$150,2,FALSE),\"\")","v":""}]
[73,"Missing",{"$f":"IFERROR(VLOOKUP(A74,Driver_01!$A$2:$B$150,2,FALSE),\"\")","v":""},{"$f":"IFERROR(VLOOKUP(A74,Driver_02!$A$2:$B$150,2,FALSE),\"\")","v":""},{"$f":"IFERROR(VLOOKUP(A74,Driver_03!$A$2:$B$150,2,FALSE),\"\")","v":""},{"$f":"IFERROR(VLOOKUP(A74,Driver_04!$A$2:$B$150,2,FALSE),\"\")","v":""},{"$f":"IFERROR(VLOOKUP(A74,Shop_01!$A$2:$B$188,2,FALSE),\"\")","v":""},null,273,"Missing",{"$f":"IFERROR(VLOOKUP(I74,Driver_01!$A$2:$B$150,2,FALSE),\"\")","v":""},{"$f":"IFERROR(VLOOKUP(I74,Driver_02!$A$2:$B$150,2,FALSE),\"\")","v":""},{"$f":"IFERROR(VLOOKUP(I74,Driver_03!$A$2:$B$150,2,FALSE),\"\")","v":""},{"$f":"IFERROR(VLOOKUP(I74,Driver_04!$A$2:$B$150,2,FALSE),\"\")","v":""},{"$f":"IFERROR(VLOOKUP(I74,Shop_01!$A$2:$B$150,2,FALSE),\"\")","v":""}]
[74,"Missing",{"$f":"IFERROR(VLOOKUP(A75,Driver_01!$A$2:$B$150,2,FALSE),\"\")","v":""},{"$f":"IFERROR(VLOOKUP(A75,Driver_02!$A$2:$B$150,2,FALSE),\"\")","v":""},{"$f":"IFERROR(VLOOKUP(A75,Driver_03!$A$2:$B$150,2,FALSE),\"\")","v":""},{"$f":"IFERROR(VLOOKUP(A75,Driver_04!$A$2:$B$150,2,FALSE),\"\")","v":""},{"$f":"IFERROR(VLOOKUP(A75,Shop_01!$A$2:$B$188,2,FALSE),\"\")","v":""},null,274,"Missing",{"$f":"IFERROR(VLOOKUP(I75,Driver_01!$A$2:$B$150,2,FALSE),\"\")","v":""},{"$f":"IFERROR(VLOOKUP(I75,Driver_02!$A$2:$B$150,2,FALSE),\"\")","v":""},{"$f":"IFERROR(VLOOKUP(I75,Driver_03!$A$2:$B$150,2,FALSE),\"\")","v":""},{"$f":"IFERROR(VLOOKUP(I75,Driver_04!$A$2:$B$150,2,FALSE),\"\")","v":""},{"$f":"IFERROR(VLOOKUP(I75,Shop_01!$A$2:$B$150,2,FALSE),\"\")","v":""}]
[75,"Missing",{"$f":"IFERROR(VLOOKUP(A76,Driver_01!$A$2:$B$150,2,FALSE),\"\")","v":""},{"$f":"IFERROR(VLOOKUP(A76,Driver_02!$A$2:$B$150,2,FALSE),\"\")","v":""},{"$f":"IFERROR(VLOOKUP(A76,Driver_03!$A$2:$B$150,2,FALSE),\"\")","v":""},{"$f":"IFERROR(VLOOKUP(A76,Driver_04!$A$2:$B$150,2,FALSE),\"\")","v":""},{"$f":"IFERROR(VLOOKUP(A76,Shop_01!$A$2:$B$188,2,FALSE),\"\")","v":""},null,275,"Missing",{"$f":"IFERROR(VLOOKUP(I76,Driver_01!$A$2:$B$150,2,FALSE),\"\")","v":""},{"$f":"IFERROR(VLOOKUP(I76,Driver_02!$A$2:$B$150,2,FALSE),\"\")","v":""},{"$f":"IFERROR(VLOOKUP(I76,Driver_03!$A$2:$B$150,2,FALSE),\"\")","v":""},{"$f":"IFERROR(VLOOKUP(I76,Driver_04!$A$2:$B$150,2,FALSE),\"\")","v":""},{"$f":"IFERROR(VLOOKUP(I76,Shop_01!$A$2:$B$150,2,FALSE),\"\")","v":""}]
[76,"Missing",{"$f":"IFERROR(VLOOKUP(A77,Driver_01!$A$2:$B$150,2,FALSE),\"\")","v":""},{"$f":"IFERROR(VLOOKUP(A77,Driver_02!$A$2:$B$150,2,FALSE),\"\")","v":""},{"$f":"IFERROR(VLOOKUP(A77,Driver_03!$A$2:$B$150,2,FALSE),\"\")","v":""},{"$f":"IFERROR(VLOOKUP(A77,Driver_04!$A$2:$B$150,2,FALSE),\"\")","v":""},{"$f":"IFERROR(VLOOKUP(A77,Shop_01!$A$2:$B$188,2,FALSE),\"\")","v":""},null,276,"Missing",{"$f":"IFERROR(VLOOKUP(I77,Driver_01!$A$2:$B$150,2,FALSE),\"\")","v":""},{"$f":"IFERROR(VLOOKUP(I77,Driver_02!$A$2:$B$150,2,FALSE),\"\")","v":""},{"$f":"IFERROR(VLOOKUP(I77,Driver_03!$A$2:$B$150,2,FALSE),\"\")","v":""},{"$f":"IFERROR(VLOOKUP(I77,Driver_04!$A$2:$B$150,2,FALSE),\"\")","v":""},{"$f":"IFERROR(VLOOKUP(I77,Shop_01!$A$2:$B$150,2,FALSE),\"\")","v":""}]
[77,"Missing",{"$f":"IFERROR(VLOOKUP(A78,Driver_01!$A$2:$B$150,2,FALSE),\"\")","v":""},{"$f":"IFERROR(VLOOKUP(A78,Driver_02!$A$2:$B$150,2,FALSE),\"\")","v":""},{"$f":"IFERROR(VLOOKUP(A78,Driver_03!$A$2:$B$150,2,FALSE),\"\")","v":""},{"$f":"IFERROR(VLOOKUP(A78,Driver_04!$A$2:$B$150,2,FALSE),\"\")","v":""},{"$f":"IFERROR(VLOOKUP(A78,Shop_01!$A$2:$B$188,2,FALSE),\"\")","v":""},null,277,"Missing",{"$f":"IFERROR(VLOOKUP(I78,Driver_01!$A$2:$B$150,2,FALSE),\"\")","v":""},{"$f":"IFERROR(VLOOKUP(I78,Driver_02!$A$2:$B$150,2,FALSE),\"\")","v":""},{"$f":"IFERROR(VLOOKUP(I78,Driver_03!$A$2:$B$150,2,FALSE),\"\")","v":""},{"$f":"IFERROR(VLOOKUP(I78,Driver_04!$A$2:$B$150,2,FALSE),\"\")","v":""},{"$f":"IFERROR(VLOOKUP(I78,Shop_01!$A$2:$B$150,2,FALSE),\"\")","v":""}]
[78,"Missing",{"$f":"IFERROR(VLOOKUP(A79,Driver_01!$A$2:$B$150,2,FALSE),\"\")","v":""},{"$f":"IFERROR(VLOOKUP(A79,Driver_02!$A$2:$B$150,2,FALSE),\"\")","v":""},{"$f":"IFERROR(VLOOKUP(A79,Driver_03!$A$2:$B$150,2,FALSE),\"\")","v":""},{"$f":"IFERROR(VLOOKUP(A79,Driver_04!$A$2:$B$150,2,FALSE),\"\")","v":""},{"$f":"IFERROR(VLOOKUP(A79,Shop_01!$A$2:$B$188,2,FALSE),\"\")","v":""},null,278,"Missing",{"$f":"IFERROR(VLOOKUP(I79,Driver_01!$A$2:$B$150,2,FALSE),\"\")","v":""},{"$f":"IFERROR(VLOOKUP(I79,Driver_02!$A$2:$B$150,2,FALSE),\"\")","v":""},{"$f":"IFERROR(VLOOKUP(I79,Driver_03!$A$2:$B$150,2,FALSE),\"\")","v":""},{"$f":"IFERROR(VLOOKUP(I79,Driver_04!$A$2:$B$150,2,FALSE),\"\")","v":""},{"$f":"IFERROR(VLOOKUP(I79,Shop_01!$A$2:$B$150,2,FALSE),\"\")","v":""}]
[79,"Missing",{"$f":"IFERROR(VLOOKUP(A80,Driver_01!$A$2:$B$150,2,FALSE),\"\")","v":""},{"$f":"IFERROR(VLOOKUP(A80,Driver_02!$A$2:$B$150,2,FALSE),\"\")","v":""},{"$f":"IFERROR(VLOOKUP(A80,Driver_03!$A$2:$B$150,2,FALSE),\"\")","v":""},{"$f":"IFERROR(VLOOKUP(A80,Driver_04!$A$2:$B$150,2,FALSE),\"\")","v":""},{"$f":"IFERROR(VLOOKUP(A80,Shop_01!$A$2:$B$188,2,FALSE),\"\")","v":""},null,279,"Missing",{"$f":"IFERROR(VLOOKUP(I80,Driver_01!$A$2:$B$150,2,FALSE),\"\")","v":""},{"$f":"IFERROR(VLOOKUP(I80,Driver_02!$A$2:$B$150,2,FALSE),\"\")","v":""},{"$f":"IFERROR(VLOOKUP(I80,Driver_03!$A$2:$B$150,2,FALSE),\"\")","v":""},{"$f":"IFERROR(VLOOKUP(I80,Driver_04!$A$2:$B$150,2,FALSE),\"\")","v":""},{"$f":"IFERROR(VLOOKUP(I80,Shop_01!$A$2:$B$150,2,FALSE),\"\")","v":""}]
[80,"Missing",{"$f":"IFERROR(VLOOKUP(A81,Driver_01!$A$2:$B$150,2,FALSE),\"\")","v":""},{"$f":"IFERROR(VLOOKUP(A81,Driver_02!$A$2:$B$150,2,FALSE),\"\")","v":""},{"$f":"IFERROR(VLOOKUP(A81,Driver_03!$A$2:$B$150,2,FALSE),\"\")","v":""},{"$f":"IFERROR(VLOOKUP(A81,Driver_04!$A$2:$B$150,2,FALSE),\"\")","v":""},{"$f":"IFERROR(VLOOKUP(A81,Shop_01!$A$2:$B$188,2,FALSE),\"\")","v":""},null,280,"Missing",{"$f":"IFERROR(VLOOKUP(I81,Driver_01!$A$2:$B$150,2,FALSE),\"\")","v":""},{"$f":"IFERROR(VLOOKUP(I81,Driver_02!$A$2:$B$150,2,FALSE),\"\")","v":""},{"$f":"IFERROR(VLOOKUP(I81,Driver_03!$A$2:$B$150,2,FALSE),\"\")","v":""},{"$f":"IFERROR(VLOOKUP(I81,Driver_04!$A$2:$B$150,2,FALSE),\"\")","v":""},{"$f":"IFERROR(VLOOKUP(I81,Shop_01!$A$2:$B$150,2,FALSE),\"\")","v":""}]
[81,"Missing",{"$f":"IFERROR(VLOOKUP(A82,Driver_01!$A$2:$B$150,2,FALSE),\"\")","v":""},{"$f":"IFERROR(VLOOKUP(A82,Driver_02!$A$2:$B$150,2,FALSE),\"\")","v":""},{"$f":"IFERROR(VLOOKUP(A82,Driver_03!$A$2:$B$150,2,FALSE),\"\")","v":""},{"$f":"IFERROR(VLOOKUP(A82,Driver_04!$A$2:$B$150,2,FALSE),\"\")","v":""},{"$f":"IFERROR(VLOOKUP(A82,Shop_01!$A$2:$B$188,2,FALSE),\"\")","v":""},null,281,"Missing",{"$f":"IFERROR(VLOOKUP(I82,Driver_01!$A$2:$B$150,2,FALSE),\"\")","v":""},{"$f":"IFERROR(VLOOKUP(I82,Driver_02!$A$2:$B$150,2,FALSE),\"\")","v":""},{"$f":"IFERROR(VLOOKUP(I82,Driver_03!$A$2:$B$150,2,FALSE),\"\")","v":""},{"$f":"IFERROR(VLOOKUP(I82,Driver_04!$A$2:$B$150,2,FALSE),\"\")","v":""},{"$f":"IFERROR(VLOOKUP(I82,Shop_01!$A$2:$B$150,2,FALSE),\"\")","v":""}]
[82,"Missing",{"$f":"IFERROR(VLOOKUP(A83,Driver_01!$A$2:$B$150,2,FALSE),\"\")","v":""},{"$f":"IFERROR(VLOOKUP(A83,Driver_02!$A$2:$B$150,2,FALSE),\"\")","v":""},{"$f":"IFERROR(VLOOKUP(A83,Driver_03!$A$2:$B$150,2,FALSE),\"\")","v":""},{"$f":"IFERROR(VLOOKUP(A83,Driver_04!$A$2:$B$150,2,FALSE),\"\")","v":""},{"$f":"IFERROR(VLOOKUP(A83,Shop_01!$A$2:$B$188,2,FALSE),\"\")","v":""},null,282,"Missing",{"$f":"IFERROR(VLOOKUP(I83,Driver_01!$A$2:$B$150,2,FALSE),\"\")","v":""},{"$f":"IFERROR(VLOOKUP(I83,Driver_02!$A$2:$B$150,2,FALSE),\"\")","v":""},{"$f":"IFERROR(VLOOKUP(I83,Driver_03!$A$2:$B$150,2,FALSE),\"\")","v":""},{"$f":"IFERROR(VLOOKUP(I83,Driver_04!$A$2:$B$150,2,FALSE),\"\")","v":""},{"$f":"IFERROR(VLOOKUP(I83,Shop_01!$A$2:$B$150,2,FALSE),\"\")","v":""}]
[83,"Missing",{"$f":"IFERROR(VLOOKUP(A84,Driver_01!$A$2:$B$150,2,FALSE),\"\")","v":""},{"$f":"IFERROR(VLOOKUP(A84,Driver_02!$A$2:$B$150,2,FALSE),\"\")","v":""},{"$f":"IFERROR(VLOOKUP(A84,Driver_03!$A$2:$B$150,2,FALSE),\"\")","v":""},{"$f":"IFERROR(VLOOKUP(A84,Driver_04!$A$2:$B$150,2,FALSE),\"\")","v":""},{"$f":"IFERROR(VLOOKUP(A84,Shop_01!$A$2:$B$188,2,FALSE),\"\")","v":""},null,283,"Missing",{"$f":"IFERROR(VLOOKUP(I84,Driver_01!$A$2:$B$150,2,FALSE),\"\")","v":""},{"$f":"IFERROR(VLOOKUP(I84,Driver_02!$A$2:$B$150,2,FALSE),\"\")","v":""},{"$f":"IFERROR(VLOOKUP(I84,Driver_03!$A$2:$B$150,2,FALSE),\"\")","v":""},{"$f":"IFERROR(VLOOKUP(I84,Driver_04!$A$2:$B$150,2,FALSE),\"\")","v":""},{"$f":"IFERROR(VLOOKUP(I84,Shop_01!$A$2:$B$150,2,FALSE),\"\")","v":""}]
[84,"Missing",{"$f":"IFERROR(VLOOKUP(A85,Driver_01!$A$2:$B$150,2,FALSE),\"\")","v":""},{"$f":"IFERROR(VLOOKUP(A85,Driver_02!$A$2:$B$150,2,FALSE),\"\")","v":""},{"$f":"IFERROR(VLOOKUP(A85,Driver_03!$A$2:$B$150,2,FALSE),\"\")","v":""},{"$f":"IFERROR(VLOOKUP(A85,Driver_04!$A$2:$B$150,2,FALSE),\"\")","v":""},{"$f":"IFERROR(VLOOKUP(A85,Shop_01!$A$2:$B$188,2,FALSE),\"\")","v":""},null,284,"Missing",{"$f":"IFERROR(VLOOKUP(I85,Driver_01!$A$2:$B$150,2,FALSE),\"\")","v":""},{"$f":"IFERROR(VLOOKUP(I85,Driver_02!$A$2:$B$150,2,FALSE),\"\")","v":""},{"$f":"IFERROR(VLOOKUP(I85,Driver_03!$A$2:$B$150,2,FALSE),\"\")","v":""},{"$f":"IFERROR(VLOOKUP(I85,Driver_04!$A$2:$B$150,2,FALSE),\"\")","v":""},{"$f":"IFERROR(VLOOKUP(I85,Shop_01!$A$2:$B$150,2,FALSE),\"\")","v":""}]
[85,"Missing",{"$f":"IFERROR(VLOOKUP(A86,Driver_01!$A$2:$B$150,2,FALSE),\"\")","v":""},{"$f":"IFERROR(VLOOKUP(A86,Driver_02!$A$2:$B$150,2,FALSE),\"\")","v":""},{"$f":"IFERROR(VLOOKUP(A86,Driver_03!$A$2:$B$150,2,FALSE),\"\")","v":""},{"$f":"IFERROR(VLOOKUP(A86,Driver_04!$A$2:$B$150,2,FALSE),\"\")","v":""},{"$f":"IFERROR(VLOOKUP(A86,Shop_01!$A$2:$B$188,2,FALSE),\"\")","v":""},null,285,"Missing",{"$f":"IFERROR(VLOOKUP(I86,Driver_01!$A$2:$B$150,2,FALSE),\"\")","v":""},{"$f":"IFERROR(VLOOKUP(I86,Driver_02!$A$2:$B$150,2,FALSE),\"\")","v":""},{"$f":"IFERROR(VLOOKUP(I86,Driver_03!$A$2:$B$150,2,FALSE),\"\")","v":""},{"$f":"IFERROR(VLOOKUP(I86,Driver_04!$A$2:$B$150,2,FALSE),\"\")","v":""},{"$f":"IFERROR(VLOOKUP(I86,Shop_01!$A$2:$B$150,2,FALSE),\"\")","v":""}]
[86,"Missing",{"$f":"IFERROR(VLOOKUP(A87,Driver_01!$A$2:$B$150,2,FALSE),\"\")","v":""},{"$f":"IFERROR(VLOOKUP(A87,Driver_02!$A$2:$B$150,2,FALSE),\"\")","v":""},{"$f":"IFERROR(VLOOKUP(A87,Driver_03!$A$2:$B$150,2,FALSE),\"\")","v":""},{"$f":"IFERROR(VLOOKUP(A87,Driver_04!$A$2:$B$150,2,FALSE),\"\")","v":""},{"$f":"IFERROR(VLOOKUP(A87,Shop_01!$A$2:$B$188,2,FALSE),\"\")","v":""},null,286,"Missing",{"$f":"IFERROR(VLOOKUP(I87,Driver_01!$A$2:$B$150,2,FALSE),\"\")","v":""},{"$f":"IFERROR(VLOOKUP(I87,Driver_02!$A$2:$B$150,2,FALSE),\"\")","v":""},{"$f":"IFERROR(VLOOKUP(I87,Driver_03!$A$2:$B$150,2,FALSE),\"\")","v":""},{"$f":"IFERROR(VLOOKUP(I87,Driver_04!$A$2:$B$150,2,FALSE),\"\")","v":""},{"$f":"IFERROR(VLOOKUP(I87,Shop_01!$A$2:$B$150,2,FALSE),\"\")","v":""}]
[87,"Missing",{"$f":"IFERROR(VLOOKUP(A88,Driver_01!$A$2:$B$150,2,FALSE),\"\")","v":""},{"$f":"IFERROR(VLOOKUP(A88,Driver_02!$A$2:$B$150,2,FALSE),\"\")","v":""},{"$f":"IFERROR(VLOOKUP(A88,Driver_03!$A$2:$B$150,2,FALSE),\"\")","v":""},{"$f":"IFERROR(VLOOKUP(A88,Driver_04!$A$2:$B$150,2,FALSE),\"\")","v":""},{"$f":"IFERROR(VLOOKUP(A88,Shop_01!$A$2:$B$188,2,FALSE),\"\")","v":""},null,287,"Missing",{"$f":"IFERROR(VLOOKUP(I88,Driver_01!$A$2:$B$150,2,FALSE),\"\")","v":""},{"$f":"IFERROR(VLOOKUP(I88,Driver_02!$A$2:$B$150,2,FALSE),\"\")","v":""},{"$f":"IFERROR(VLOOKUP(I88,Driver_03!$A$2:$B$150,2,FALSE),\"\")","v":""},{"$f":"IFERROR(VLOOKUP(I88,Driver_04!$A$2:$B$150,2,FALSE),\"\")","v":""},{"$f":"IFERROR(VLOOKUP(I88,Shop_01!$A$2:$B$150,2,FALSE),\"\")","v":""}]
[88,"Missing",{"$f":"IFERROR(VLOOKUP(A89,Driver_01!$A$2:$B$150,2,FALSE),\"\")","v":""},{"$f":"IFERROR(VLOOKUP(A89,Driver_02!$A$2:$B$150,2,FALSE),\"\")","v":""},{"$f":"IFERROR(VLOOKUP(A89,Driver_03!$A$2:$B$150,2,FALSE),\"\")","v":""},{"$f":"IFERROR(VLOOKUP(A89,Driver_04!$A$2:$B$150,2,FALSE),\"\")","v":""},{"$f":"IFERROR(VLOOKUP(A89,Shop_01!$A$2:$B$188,2,FALSE),\"\")","v":""},null,288,"Missing",{"$f":"IFERROR(VLOOKUP(I89,Driver_01!$A$2:$B$150,2,FALSE),\"\")","v":""},{"$f":"IFERROR(VLOOKUP(I89,Driver_02!$A$2:$B$150,2,FALSE),\"\")","v":""},{"$f":"IFERROR(VLOOKUP(I89,Driver_03!$A$2:$B$150,2,FALSE),\"\")","v":""},{"$f":"IFERROR(VLOOKUP(I89,Driver_04!$A$2:$B$150,2,FALSE),\"\")","v":""},{"$f":"IFERROR(VLOOKUP(I89,Shop_01!$A$2:$B$150,2,FALSE),\"\")","v":""}]
[89,"Missing",{"$f":"IFERROR(VLOOKUP(A90,Driver_01!$A$2:$B$150,2,FALSE),\"\")","v":""},{"$f":"IFERROR(VLOOKUP(A90,Driver_02!$A$2:$B$150,2,FALSE),\"\")","v":""},{"$f":"IFERROR(VLOOKUP(A90,Driver_03!$A$2:$B$150,2,FALSE),\"\")","v":""},{"$f":"IFERROR(VLOOKUP(A90,Driver_04!$A$2:$B$150,2,FALSE),\"\")","v":""},{"$f":"IFERROR(VLOOKUP(A90,Shop_01!$A$2:$B$188,2,FALSE),\"\")","v":""},null,289,"Missing",{"$f":"IFERROR(VLOOKUP(I90,Driver_01!$A$2:$B$150,2,FALSE),\"\")","v":""},{"$f":"IFERROR(VLOOKUP(I90,Driver_02!$A$2:$B$150,2,FALSE),\"\")","v":""},{"$f":"IFERROR(VLOOKUP(I90,Driver_03!$A$2:$B$150,2,FALSE),\"\")","v":""},{"$f":"IFERROR(VLOOKUP(I90,Driver_04!$A$2:$B$150,2,FALSE),\"\")","v":""},{"$f":"IFERROR(VLOOKUP(I90,Shop_01!$A$2:$B$150,2,FALSE),\"\")","v":""}]
[90,"Missing",{"$f":"IFERROR(VLOOKUP(A91,Driver_01!$A$2:$B$150,2,FALSE),\"\")","v":""},{"$f":"IFERROR(VLOOKUP(A91,Driver_02!$A$2:$B$150,2,FALSE),\"\")","v":""},{"$f":"IFERROR(VLOOKUP(A91,Driver_03!$A$2:$B$150,2,FALSE),\"\")","v":""},{"$f":"IFERROR(VLOOKUP(A91,Driver_04!$A$2:$B$150,2,FALSE),\"\")","v":""},{"$f":"IFERROR(VLOOKUP(A91,Shop_01!$A$2:$B$188,2,FALSE),\"\")","v":""},null,290,"Missing",{"$f":"IFERROR(VLOOKUP(I91,Driver_01!$A$2:$B$150,2,FALSE),\"\")","v":""},{"$f":"IFERROR(VLOOKUP(I91,Driver_02!$A$2:$B$150,2,FALSE),\"\")","v":""},{"$f":"IFERROR(VLOOKUP(I91,Driver_03!$A$2:$B$150,2,FALSE),\"\")","v":""},{"$f":"IFERROR(VLOOKUP(I91,Driver_04!$A$2:$B$150,2,FALSE),\"\")","v":""},{"$f":"IFERROR(VLOOKUP(I91,Shop_01!$A$2:$B$150,2,FALSE),\"\")","v":""}]
[91,"Missing",{"$f":"IFERROR(VLOOKUP(A92,Driver_01!$A$2:$B$150,2,FALSE),\"\")","v":""},{"$f":"IFERROR(VLOOKUP(A92,Driver_02!$A$2:$B$150,2,FALSE),\"\")","v":""},{"$f":"IFERROR(VLOOKUP(A92,Driver_03!$A$2:$B$150,2,FALSE),\"\")","v":""},{"$f":"IFERROR(VLOOKUP(A92,Driver_04!$A$2:$B$150,2,FALSE),\"\")","v":""},{"$f":"IFERROR(VLOOKUP(A92,Shop_01!$A$2:$B$188,2,FALSE),\"\")","v":""},null,291,"Missing",{"$f":"IFERROR(VLOOKUP(I92,Driver_01!$A$2:$B$150,2,FALSE),\"\")","v":""},{"$f":"IFERROR(VLOOKUP(I92,Driver_02!$A$2:$B$150,2,FALSE),\"\")","v":""},{"$f":"IFERROR(VLOOKUP(I92,Driver_03!$A$2:$B$150,2,FALSE),\"\")","v":""},{"$f":"IFERROR(VLOOKUP(I92,Driver_04!$A$2:$B$150,2,FALSE),\"\")","v":""},{"$f":"IFERROR(VLOOKUP(I92,Shop_01!$A$2:$B$150,2,FALSE),\"\")","v":""}]
[92,"Missing",{"$f":"IFERROR(VLOOKUP(A93,Driver_01!$A$2:$B$150,2,FALSE),\"\")","v":""},{"$f":"IFERROR(VLOOKUP(A93,Driver_02!$A$2:$B$150,2,FALSE),\"\")","v":""},{"$f":"IFERROR(VLOOKUP(A93,Driver_03!$A$2:$B$150,2,FALSE),\"\")","v":""},{"$f":"IFERROR(VLOOKUP(A93,Driver_04!$A$2:$B$150,2,FALSE),\"\")","v":""},{"$f":"IFERROR(VLOOKUP(A93,Shop_01!$A$2:$B$188,2,FALSE),\"\")","v":""},null,292,"Missing",{"$f":"IFERROR(VLOOKUP(I93,Driver_01!$A$2:$B$150,2,FALSE),\"\")","v":""},{"$f":"IFERROR(VLOOKUP(I93,Driver_02!$A$2:$B$150,2,FALSE),\"\")","v":""},{"$f":"IFERROR(VLOOKUP(I93,Driver_03!$A$2:$B$150,2,FALSE),\"\")","v":""},{"$f":"IFERROR(VLOOKUP(I93,Driver_04!$A$2:$B$150,2,FALSE),\"\")","v":""},{"$f":"IFERROR(VLOOKUP(I93,Shop_01!$A$2:$B$150,2,FALSE),\"\")","v":""}]
[93,"Missing",{"$f":"IFERROR(VLOOKUP(A94,Driver_01!$A$2:$B$150,2,FALSE),\"\")","v":""},{"$f":"IFERROR(VLOOKUP(A94,Driver_02!$A$2:$B$150,2,FALSE),\"\")","v":""},{"$f":"IFERROR(VLOOKUP(A94,Driver_03!$A$2:$B$150,2,FALSE),\"\")","v":""},{"$f":"IFERROR(VLOOKUP(A94,Driver_04!$A$2:$B$150,2,FALSE),\"\")","v":""},{"$f":"IFERROR(VLOOKUP(A94,Shop_01!$A$2:$B$188,2,FALSE),\"\")","v":""},null,293,"Missing",{"$f":"IFERROR(VLOOKUP(I94,Driver_01!$A$2:$B$150,2,FALSE),\"\")","v":""},{"$f":"IFERROR(VLOOKUP(I94,Driver_02!$A$2:$B$150,2,FALSE),\"\")","v":""},{"$f":"IFERROR(VLOOKUP(I94,Driver_03!$A$2:$B$150,2,FALSE),\"\")","v":""},{"$f":"IFERROR(VLOOKUP(I94,Driver_04!$A$2:$B$150,2,FALSE),\"\")","v":""},{"$f":"IFERROR(VLOOKUP(I94,Shop_01!$A$2:$B$150,2,FALSE),\"\")","v":""}]
[94,"Missing",{"$f":"IFERROR(VLOOKUP(A95,Driver_01!$A$2:$B$150,2,FALSE),\"\")","v":""},{"$f":"IFERROR(VLOOKUP(A95,Driver_02!$A$2:$B$150,2,FALSE),\"\")","v":""},{"$f":"IFERROR(VLOOKUP(A95,Driver_03!$A$2:$B$150,2,FALSE),\"\")","v":""},{"$f":"IFERROR(VLOOKUP(A95,Driver_04!$A$2:$B$150,2,FALSE),\"\")","v":""},{"$f":"IFERROR(VLOOKUP(A95,Shop_01!$A$2:$B$188,2,FALSE),\"\")","v":""},null,294,"Missing",{"$f":"IFERROR(VLOOKUP(I95,Driver_01!$A$2:$B$150,2,FALSE),\"\")","v":""},{"$f":"IFERROR(VLOOKUP(I95,Driver_02!$A$2:$B$150,2,FALSE),\"\")","v":""},{"$f":"IFERROR(VLOOKUP(I95,Driver_03!$A$2:$B$150,2,FALSE),\"\")","v":""},{"$f":"IFERROR(VLOOKUP(I95,Driver_04!$A$2:$B$150,2,FALSE),\"\")","v":""},{"$f":"IFERROR(VLOOKUP(I95,Shop_01!$A$2:$B$150,2,FALSE),\"\")","v":""}]
[95,"Missing",{"$f":"IFERROR(VLOOKUP(A96,Driver_01!$A$2:$B$150,2,FALSE),\"\")","v":""},{"$f":"IFERROR(VLOOKUP(A96,Driver_02!$A$2:$B$150,2,FALSE),\"\")","v":""},{"$f":"IFERROR(VLOOKUP(A96,Driver_03!$A$2:$B$150,2,FALSE),\"\")","v":""},{"$f":"IFERROR(VLOOKUP(A96,Driver_04!$A$2:$B$150,2,FALSE),\"\")","v":""},{"$f":"IFERROR(VLOOKUP(A96,Shop_01!$A$2:$B$188,2,FALSE),\"\")","v":""},null,295,"Missing",{"$f":"IFERROR(VLOOKUP(I96,Driver_01!$A$2:$B$150,2,FALSE),\"\")","v":""},{"$f":"IFERROR(VLOOKUP(I96,Driver_02!$A$2:$B$150,2,FALSE),\"\")","v":""},{"$f":"IFERROR(VLOOKUP(I96,Driver_03!$A$2:$B$150,2,FALSE),\"\")","v":""},{"$f":"IFERROR(VLOOKUP(I96,Driver_04!$A$2:$B$150,2,FALSE),\"\")","v":""},{"$f":"IFERROR(VLOOKUP(I96,Shop_01!$A$2:$B$150,2,FALSE),\"\")","v":""}]
[96,"Missing",{"$f":"IFERROR(VLOOKUP(A97,Driver_01!$A$2:$B$150,2,FALSE),\"\")","v":""},{"$f":"IFERROR(VLOOKUP(A97,Driver_02!$A$2:$B$150,2,FALSE),\"\")","v":""},{"$f":"IFERROR(VLOOKUP(A97,Driver_03!$A$2:$B$150,2,FALSE),\"\")","v":""},{"$f":"IFERROR(VLOOKUP(A97,Driver_04!$A$2:$B$150,2,FALSE),\"\")","v":""},{"$f":"IFERROR(VLOOKUP(A97,Shop_01!$A$2:$B$188,2,FALSE),\"\")","v":""},null,296,"Missing",{"$f":"IFERROR(VLOOKUP(I97,Driver_01!$A$2:$B$150,2,FALSE),\"\")","v":""},{"$f":"IFERROR(VLOOKUP(I97,Driver_02!$A$2:$B$150,2,FALSE),\"\")","v":""},{"$f":"IFERROR(VLOOKUP(I97,Driver_03!$A$2:$B$150,2,FALSE),\"\")","v":""},{"$f":"IFERROR(VLOOKUP(I97,Driver_04!$A$2:$B$150,2,FALSE),\"\")","v":""},{"$f":"IFERROR(VLOOKUP(I97,Shop_01!$A$2:$B$150,2,FALSE),\"\")","v":""}]
[97,"Missing",{"$f":"IFERROR(VLOOKUP(A98,Driver_01!$A$2:$B$150,2,FALSE),\"\")","v":""},{"$f":"IFERROR(VLOOKUP(A98,Driver_02!$A$2:$B$150,2,FALSE),\"\")","v":""},{"$f":"IFERROR(VLOOKUP(A98,Driver_03!$A$2:$B$150,2,FALSE),\"\")","v":""},{"$f":"IFERROR(VLOOKUP(A98,Driver_04!$A$2:$B$150,2,FALSE),\"\")","v":""},{"$f":"IFERROR(VLOOKUP(A98,Shop_01!$A$2:$B$188,2,FALSE),\"\")","v":""},null,297,"Missing",{"$f":"IFERROR(VLOOKUP(I98,Driver_01!$A$2:$B$150,2,FALSE),\"\")","v":""},{"$f":"IFERROR(VLOOKUP(I98,Driver_02!$A$2:$B$150,2,FALSE),\"\")","v":""},{"$f":"IFERROR(VLOOKUP(I98,Driver_03!$A$2:$B$150,2,FALSE),\"\")","v":""},{"$f":"IFERROR(VLOOKUP(I98,Driver_04!$A$2:$B$150,2,FALSE),\"\")","v":""},{"$f":"IFERROR(VLOOKUP(I98,Shop_01!$A$2:$B$150,2,FALSE),\"\")","v":""}]
[98,"Missing",{"$f":"IFERROR(VLOOKUP(A99,Driver_01!$A$2:$B$150,2,FALSE),\"\")","v":""},{"$f":"IFERROR(VLOOKUP(A99,Driver_02!$A$2:$B$150,2,FALSE),\"\")","v":""},{"$f":"IFERROR(VLOOKUP(A99,Driver_03!$A$2:$B$150,2,FALSE),\"\")","v":""},{"$f":"IFERROR(VLOOKUP(A99,Driver_04!$A$2:$B$150,2,FALSE),\"\")","v":""},{"$f":"IFERROR(VLOOKUP(A99,Shop_01!$A$2:$B$188,2,FALSE),\"\")","v":""},null,298,"Missing",{"$f":"IFERROR(VLOOKUP(I99,Driver_01!$A$2:$B$150,2,FALSE),\"\")","v":""},{"$f":"IFERROR(VLOOKUP(I99,Driver_02!$A$2:$B$150,2,FALSE),\"\")","v":""},{"$f":"IFERROR(VLOOKUP(I99,Driver_03!$A$2:$B$150,2,FALSE),\"\")","v":""},{"$f":"IFERROR(VLOOKUP(I99,Driver_04!$A$2:$B$150,2,FALSE),\"\")","v":""},{"$f":"IFERROR(VLOOKUP(I99,Shop_01!$A$2:$B$150,2,FALSE),\"\")","v":""}]
[99,"Missing",{"$f":"IFERROR(VLOOKUP(A100,Driver_01!$A$2:$B$150,2,FALSE),\"\")","v":""},{"$f":"IFERROR(VLOOKUP(A100,Driver_02!$A$2:$B$150,2,FALSE),\"\")","v":""},{"$f":"IFERROR(VLOOKUP(A100,Driver_03!$A$2:$B$150,2,FALSE),\"\")","v":""},{"$f":"IFERROR(VLOOKUP(A100,Driver_04!$A$2:$B$150,2,FALSE),\"\")","v":""},{"$f":"IFERROR(VLOOKUP(A100,Shop_01!$A$2:$B$188,2,FALSE),\"\")","v":""},null,299,"Missing",{"$f":"IFERROR(VLOOKUP(I100,Driver_01!$A$2:$B$150,2,FALSE),\"\")","v":""},{"$f":"IFERROR(VLOOKUP(I100,Driver_02!$A$2:$B$150,2,FALSE),\"\")","v":""},{"$f":"IFERROR(VLOOKUP(I100,Driver_03!$A$2:$B$150,2,FALSE),\"\")","v":""},{"$f":"IFERROR(VLOOKUP(I100,Driver_04!$A$2:$B$150,2,FALSE),\"\")","v":""},{"$f":"IFERROR(VLOOKUP(I100,Shop_01!$A$2:$B$150,2,FALSE),\"\")","v":""}]
[100,"Missing",{"$f":"IFERROR(VLOOKUP(A101,Driver_01!$A$2:$B$150,2,FALSE),\"\")","v":""},{"$f":"IFERROR(VLOOKUP(A101,Driver_02!$A$2:$B$150,2,FALSE),\"\")","v":""},{"$f":"IFERROR(VLOOKUP(A101,Driver_03!$A$2:$B$150,2,FALSE),\"\")","v":""},{"$f":"IFERROR(VLOOKUP(A101,Driver_04!$A$2:$B$150,2,FALSE),\"\")","v":""},{"$f":"IFERROR(VLOOKUP(A101,Shop_01!$A$2:$B$188,2,FALSE),\"\")","v":""},null,300,{"$f":"IF(SUM(K101:O101)<0.5,\"Missing\",SUM(K101:O101))","v":"Missing"},{"$f":"IFERROR(VLOOKUP(I101,Driver_01!$A$2:$B$150,2,FALSE),\"\")","v":""},{"$f":"IFERROR(VLOOKUP(I101,Driver_02!$A$2:$B$150,2,FALSE),\"\")","v":""},{"$f":"IFERROR(VLOOKUP(I101,Driver_03!$A$2:$B$150,2,FALSE),\"\")","v":""},{"$f":"IFERROR(VLOOKUP(I101,Driver_04!$A$2:$B$150,2,FALSE),\"\")","v":""},{"$f":"IFERROR(VLOOKUP(I101,Shop_01!$A$2:$B$150,2,FALSE),\"\")","v":""}]
[101,{"$f":"IF(SUM(C102:G102)<0.5,\"Missing\",SUM(C102:G102))","v":"Missing"},null,null,null,null,null,null,301,"Missing",{"$f":"IFERROR(VLOOKUP(I102,Driver_01!$A$2:$B$150,2,FALSE),\"\")","v":""},{"$f":"IFERROR(VLOOKUP(I102,Driver_02!$A$2:$B$150,2,FALSE),\"\")","v":""},{"$f":"IFERROR(VLOOKUP(I102,Driver_03!$A$2:$B$150,2,FALSE),\"\")","v":""},{"$f":"IFERROR(VLOOKUP(I102,Driver_04!$A$2:$B$150,2,FALSE),\"\")","v":""},{"$f":"IFERROR(VLOOKUP(I102,Shop_01!$A$2:$B$150,2,FALSE),\"\")","v":""}]
[102,"Missing",null,null,null,null,null,null,302,"Missing",{"$f":"IFERROR(VLOOKUP(I103,Driver_01!$A$2:$B$150,2,FALSE),\"\")","v":""},{"$f":"IFERROR(VLOOKUP(I103,Driver_02!$A$2:$B$150,2,FALSE),\"\")","v":""},{"$f":"IFERROR(VLOOKUP(I103,Driver_03!$A$2:$B$150,2,FALSE),\"\")","v":""},{"$f":"IFERROR(VLOOKUP(I103,Driver_04!$A$2:$B$150,2,FALSE),\"\")","v":""},{"$f":"IFERROR(VLOOKUP(I103,Shop_01!$A$2:$B$150,2,FALSE),\"\")","v":""}]
[103,"Missing",null,null,null,null,null,null,303,"Missing",{"$f":"IFERROR(VLOOKUP(I104,Driver_01!$A$2:$B$150,2,FALSE),\"\")","v":""},{"$f":"IFERROR(VLOOKUP(I104,Driver_02!$A$2:$B$150,2,FALSE),\"\")","v":""},{"$f":"IFERROR(VLOOKUP(I104,Driver_03!$A$2:$B$150,2,FALSE),\"\")","v":""},{"$f":"IFERROR(VLOOKUP(I104,Driver_04!$A$2:$B$150,2,FALSE),\"\")","v":""},{"$f":"IFERROR(VLOOKUP(I104,Shop_01!$A$2:$B$150,2,FALSE),\"\")","v":""}]

{"sheet":"Driver_01","index":2,"n_rows":40,"n_cols":10,"rows_kept":40,"cut":false,"hidden":false,"merged":[[0,4,0,5]]}
["Ticket No.","Driver_01","Visa","Delivery Charge","Post Code (over£2)",null,"Total Cash= ",{"$f":"IF(B1=\"\",\"\",SUM(B2:B39))","v":0}]
[null,null," ",{"$f":"IF(A2=\"\",\"\",IF(E2<>\"\",F2,1))","v":""},null,null,null,null,null,"Yes"]
[null,null," ",{"$f":"IF(A3=\"\",\"\",IF(E3<>\"\",F3,1))","v":""},null,null,"Total Number of Delivery",{"$f":"COUNT(A2:A39)","v":0},null," "]
[null,null,null,"",null,null,"Delivery Charge",{"$f":"SUM(D2:D39)","v":0}]
[null,null,null,""]
[null,null," ",""]
[null,null," ",""]
[null,null,null,""]
[null,null,null,""]
[null,null," ",""]
[null,null," ",""]
[null,null," ",""]
[null,null," ","",null,null,"Visa = ",{"$f":"SUMIF(C2:C39,\"=yes\",B2:B39)","v":0},{"$f":"COUNTIF(C2:C15,\"yes\")","v":0}]
[null,null," ",""]
[null,null," ",""]
[null,null,null,"",null,null,"Summary"]
[null,null,null,"",null,null,"Driver Name:"]
[null,null,null,"",null,null,"Working Hours:"]
[null,null,null,"",null,null,"Turnover:",{"$f":"H1","v":0}]
[null,null,null,"",null,null,"Cash:",{"$f":"H19-H21","v":0}]
[null,null,null,"",null,null,"Visa:",{"$f":"H13","v":0}]
[null,null,null,"",null,null,"No. Of Delivery",{"$f":"H3","v":0}]
[null,null,null,"",null,null,"Total Delivery Charge",{"$f":"H4","v":0}]
[null,null,null,"",null,null,"Wages:",{"$f":"H18*4","v":0}]
[null,null,null,"",null,null,"Cash in Bag:",{"$f":"H20-H23-H24","v":0}]
[null,null,null,""]
[null,null,null,""]
[null,null,null,""]
[null,null,null,""]
[null,null,null,""]
[null,null,null,""]
[null,null,null,""]
[null,null,null,""]
[null,null,null,""]
[null,null,null,""]
[null,null,null,""]
[null,null,null,""]
[null,null,null,""]
[null,null,null,""]
[null,null,null,{"$f":"IF(D1=\"\",\"\",SUM(D2:D38))","v":0}]

{"sheet":"Driver_02","index":3,"n_rows":40,"n_cols":10,"rows_kept":40,"cut":false,"hidden":false,"merged":[[0,4,0,5]]}
["Ticket No.","Driver_02","Visa","Delivery Charge","Post Code (over£2)",null,"Total Cash= ",{"$f":"IF(B1=\"\",\"\",SUM(B2:B39))","v":0}]
[null,null," ",{"$f":"IF(A2=\"\",\"\",IF(E2<>\"\",F2,1))","v":""},null,null,null,null,null,"Yes"]
[null,null," ",{"$f":"IF(A3=\"\",\"\",IF(E3<>\"\",F3,1))","v":""},null,null,"Total Number of Delivery",{"$f":"COUNT(A2:A39)","v":0},null," "]
[null,null,null,"",null,null,"Delivery Charge",{"$f":"SUM(D2:D39)","v":0}]
[null,null,null,""]
[null,null," ",""]
[null,null," ",""]
[null,null,null,""]
[null,null,null,""]
[null,null," ",""]
[null,null," ",""]
[null,null," ",""]
[null,null," ","",null,null,"Visa = ",{"$f":"SUMIF(C2:C39,\"=yes\",B2:B39)","v":0},{"$f":"COUNTIF(C2:C15,\"yes\")","v":0}]
[null,null," ",""]
[null,null," ",""]
[null,null,null,"",null,null,"Summary"]
[null,null,null,"",null,null,"Driver Name:"]
[null,null,null,"",null,null,"Working Hours:"]
[null,null,null,"",null,null,"Turnover:",{"$f":"H1","v":0}]
[null,null,null,"",null,null,"Cash:",{"$f":"H19-H21","v":0}]
[null,null,null,"",null,null,"Visa:",{"$f":"H13","v":0}]
[null,null,null,"",null,null,"No. Of Delivery",{"$f":"H3","v":0}]
[null,null,null,"",null,null,"Total Delivery Charge",{"$f":"H4","v":0}]
[null,null,null,"",null,null,"Wages:",{"$f":"H18*4","v":0}]
[null,null,null,"",null,null,"Cash in Bag:",{"$f":"H20-H23-H24","v":0}]
[null,null,null,""]
[null,null,null,""]
[null,null,null,""]
[null,null,null,""]
[null,null,null,""]
[null,null,null,""]
[null,null,null,""]
[null,null,null,""]
[null,null,null,""]
[null,null,null,""]
[]
[]
[]
[]
[null,null,null,{"$f":"IF(D1=\"\",\"\",SUM(D2:D38))","v":0}]

{"sheet":"Driver_03","index":4,"n_rows":40,"n_cols":10,"rows_kept":40,"cut":false,"hidden":false,"merged":[[0,4,0,5]]}
["Ticket No.","Driver_01","Visa","Delivery Charge","Post Code (over£2)",null,"Total Cash= ",{"$f":"IF(B1=\"\",\"\",SUM(B2:B39))","v":0}]
[null,null," ",{"$f":"IF(A2=\"\",\"\",IF(E2<>\"\",F2,1))","v":""},null,null,null,null,null,"Yes"]
[null,null," ",{"$f":"IF(A3=\"\",\"\",IF(E3<>\"\",F3,1))","v":""},null,null,"Total Number of Delivery",{"$f":"COUNT(A2:A39)","v":0},null," "]
[null,null,null,"",null,null,"Delivery Charge",{"$f":"SUM(D2:D39)","v":0}]
[null,null,null,""]
[null,null," ",""]
[null,null," ",""]
[null,null,null,""]
[null,null,null,""]
[null,null," ",""]
[null,null," ",""]
[null,null," ",""]
[null,null," ","",null,null,"Visa = ",{"$f":"SUMIF(C2:C39,\"=yes\",B2:B39)","v":0},{"$f":"COUNTIF(C2:C15,\"yes\")","v":0}]
[null,null," ",""]
[null,null," ",""]
[null,null,null,"",null,null,"Summary"]
[null,null,null,"",null,null,"Driver Name:"]
[null,null,null,"",null,null,"Working Hours:"]
[null,null,null,"",null,null,"Turnover:",{"$f":"H1","v":0}]
[null,null,null,"",null,null,"Cash:",{"$f":"H19-H21","v":0}]
[null,null,null,"",null,null,"Visa:",{"$f":"H13","v":0}]
[null,null,null,"",null,null,"No. Of Delivery",{"$f":"H3","v":0}]
[null,null,null,null,null,null,"Total Delivery Charge",{"$f":"H4","v":0}]
[null,null,null,"",null,null,"Wages:",{"$f":"H18*4","v":0}]
[null,null,null,"",null,null,"Cash in Bag:",{"$f":"H20-H23-H24","v":0}]
[null,null,null,""]
[null,null,null,""]
[null,null,null,""]
[null,null,null,""]
[null,null,null,""]
[null,null,null,""]
[null,null,null,""]
[null,null,null,""]
[null,null,null,""]
[null,null,null,""]
[null,null,null,""]
[null,null,null,""]
[null,null,null,""]
[null,null,null,""]
[null,null,null,{"$f":"IF(D1=\"\",\"\",SUM(D2:D38))","v":0}]

{"sheet":"Driver_04","index":5,"n_rows":40,"n_cols":10,"rows_kept":40,"cut":false,"hidden":false,"merged":[[0,4,0,5]]}
["Ticket No.","Driver_01","Visa","Delivery Charge","Post Code (over£2)",null,"Total Cash= ",{"$f":"IF(B1=\"\",\"\",SUM(B2:B39))","v":0}]
[null,null," ",{"$f":"IF(A2=\"\",\"\",IF(E2<>\"\",F2,1))","v":""},null,null,null,null,null,"Yes"]
[null,null," ",{"$f":"IF(A3=\"\",\"\",IF(E3<>\"\",F3,1))","v":""},null,null,"Total Number of Delivery",{"$f":"COUNT(A2:A39)","v":0},null," "]
[null,null,null,"",null,null,"Delivery Charge",{"$f":"SUM(D2:D39)","v":0}]
[null,null,null,""]
[null,null," ",""]
[null,null," ",""]
[null,null,null,""]
[null,null,null,""]
[null,null," ",""]
[null,null," ",""]
[null,null," ",""]
[null,null," ","",null,null,"Visa = ",{"$f":"SUMIF(C2:C39,\"=yes\",B2:B39)","v":0},{"$f":"COUNTIF(C2:C15,\"yes\")","v":0}]
[null,null," ",""]
[null,null," ",""]
[null,null,null,"",null,null,"Summary"]
[null,null,null,"",null,null,"Driver Name:"]
[null,null,null,"",null,null,"Working Hours:"]
[null,null,null,"",null,null,"Turnover:",{"$f":"H1","v":0}]
[null,null,null,"",null,null,"Cash:",{"$f":"H19-H21","v":0}]
[null,null,null,"",null,null,"Visa:",{"$f":"H13","v":0}]
[null,null,null,"",null,null,"No. Of Delivery",{"$f":"H3","v":0}]
[null,null,null,null,null,null,"Total Delivery Charge",{"$f":"H4","v":0}]
[null,null,null,"",null,null,"Wages:",{"$f":"H18*4","v":0}]
[null,null,null,"",null,null,"Cash in Bag:",{"$f":"H20-H23-H24","v":0}]
[null,null,null,""]
[null,null,null,""]
[null,null,null,""]
[null,null,null,""]
[null,null,null,""]
[null,null,null,""]
[null,null,null,""]
[null,null,null,""]
[null,null,null,""]
[null,null,null,""]
[null,null,null,""]
[null,null,null,""]
[null,null,null,""]
[null,null,null,""]
[null,null,null,{"$f":"IF(D1=\"\",\"\",SUM(D2:D38))","v":0}]

{"sheet":"Shop_01","index":6,"n_rows":93,"n_cols":11,"rows_kept":93,"cut":false,"hidden":false,"merged":[]}
["Ticket No.","Shop","Visa",null,null,"Total = ",{"$f":"IF(B1=\"\",\"\",SUM(B2:B91))","v":0}]
[]
[]
[]
[]
[]
[]
[]
[]
[]
[null,null,null,null,null,null,null,null,null,null," "]
[]
[]
[]
[]
[]
[]
[]
[]
[]
[]
[]
[]
[]
[]
[]
[]
[]
[]
[]
[]
[]
[]
[]
[]
[]
[]
[]
[]
[]
[]
[]
[]
[]
[]
[]
[]
[]
[]
[]
[]
[]
[]
[]
[]
[]
[]
[]
[]
[]
[]
[]
[]
[]
[]
[]
[]
[]
[]
[]
[]
[]
[]
[]
[]
[]
[]
[]
[]
[]
[]
[]
[]
[]
[]
[]
[]
[]
[]
[]
[]
[]
[null,null,null,{"$f":"IF(D1=\"\",\"\",SUM(D2:D38))","v":""},{"$f":"IF(E1=\"\",\"\",SUM(E2:E38))","v":""}]

{"sheet":"Summary","index":7,"n_rows":10,"n_cols":5,"rows_kept":10,"cut":false,"hidden":false,"merged":[]}
[]
[]
[null,null,{"$f":"TODAY()","v":"2018-09-29"}]
[]
[]
[null,null,"Delivery",{"$f":"SUM('General Tickets'!C2:F301)","v":0},{"$f":"COUNT('General Tickets'!C2:F301)","v":0}]
[null,null,"Shop",{"$f":"SUM('General Tickets'!G2:G301)","v":0},{"$f":"COUNT('General Tickets'!G2:G301)","v":0}]
[]
[]
[null,null,"Grand Total",{"$f":"SUM(D6:D8)","v":0}]

{"sheet":"Checking","index":8,"n_rows":21,"n_cols":21,"rows_kept":21,"cut":false,"hidden":false,"merged":[[6,2,6,3],[6,4,6,5],[6,14,6,15],[6,16,6,17],[27,14,27,15],[27,16,27,17]]}
[]
[null,"Business Turnover",{"$f":"Summary!D7","v":0},null,null,null,null,null,null,null,null,null,null,"Turnover"]
[null,"Cash Flow",273,null,null,null,null,null,null,null,null,null,null,"Cash Flow"]
[null,"Shopping",0,null,null,null,null,null,null,null,null,null,null,"Shopping"]
[null,"Total =",{"$f":"SUM(C2:C3)-C4","v":273},null,null,null,null,null,null,null,null,null,null,"Total ="]
[]
[null,null,"Till",null,"Bag",null,null,null,null,null,null,null,null,null,"Till",null,"Bag",null,"D_01","D_02","D_03"]
[null,50,null,{"$f":"C8*B8","v":0},null,{"$f":"E8*B8","v":0},null,null,null,null,null,null,null,50]
[null,20,null,{"$f":"C9*B9","v":0},null,0,null,null,null,null,null,null,null,20,null,null,null,{"$f":"Q9*N9","v":0}]
[null,10,null,0,5,50,null,null,null,null,null,null,null,10,null,null,null,0]
[null,5,null,0,20,100,null,null,null,null,null,null,null,5,null,null,null,0]
[null,1,null,{"$f":"C12*B12","v":0},80,{"$f":"E12*B12","v":80},null,null,null,null,null,null,null,1,null,null,null,0]
[null,0.5,null,{"$f":"C13*B13","v":0},20,{"$f":"E13*B13","v":10},null,null,null,null,null,null,null,0.5,null,null,null,0]
[null,0.2,null,{"$f":"C14*B14","v":0},50,{"$f":"E14*B14","v":10},null,null,null,null,null,null,null,0.2,null,null,null,0]
[null,0.1,null,{"$f":"C15*B15","v":0},30,{"$f":"E15*B15","v":3},null,null,null,null,null,null,null,0.1,null,null,null,0]
[null,"VISA",null,{"$f":"C16","v":0},null,null,null,null,null,null,null,null,null,0.05,null,null,null,0]
[]
[null,null,{"$f":"SUM(G8:G16)","v":0},{"$f":"SUM(D8:D16)","v":0},null,{"$f":"SUM(F8:F16)","v":253},null,null,null,null,null,null,null,null,null,{"$f":"SUM(P8:P16)","v":0},null,{"$f":"SUM(R8:R16)","v":0}]
[null,"Total =",{"$f":"SUM(C18:F18)","v":253},null,null,null,null,null,null,null,null,null,null,"Total ="]
[null,"Error",{"$f":"C5-C19","v":20},null,null,null,null,null,null,null,null,null,null,"Error"]
[null,"Counter Sign",null,null,null,null,null,null,null,null,null,null,null,"Counter Sign"]